{"text_format":"1","workbook":"xlsx","n_sheets":5,"sheets":["Datos","TD","Menu","Discapacidad","Preventivo"],"not_rendered":{"charts":0,"images":32,"macros":1,"external_links":0,"defined_names":18,"comments":0,"pivot_tables":1},"unopened":[],"bounds":{"document_bytes":16777216,"sheet_cells":100000,"rows_first":2000,"rows_last":500,"rows_between":2000,"halvings":0,"cell_chars":16384,"cell_head_chars":4096},"cells_cut":0,"cells_raw":0,"read":"whole","date_system":"1900"}

{"sheet":"Datos","index":0,"n_rows":446,"n_cols":36,"rows_kept":446,"cut":false,"hidden":true,"merged":[]}
[]
[]
[]
[]
[]
[]
[]
[]
[null,"ANO",null,"MESES",null,"COD_RED","DESC_RED","RED",null,"COD_RED","COD_MIC","DESC_MICRO","MICROREDES",null,"COD_ESTAB","DESC_ESTAB","COD_RED","COD_MIC","COD_PROV","COD_DIST","REDMIC","CONCATENAR",null,"COD_PROV","DESC_PROV","CONCATENAR",null,"COD_PROV","COD_DIST","DESC_DIST","PROVDIST","CONCATENAR",null,"UE"]
[null,2025,null,"01-Enero",null,"01","CUSCO SUR",{"$f":"CONCATENATE(F10,\" - \",G10)","v":"01 - CUSCO SUR"},null,"00","00","NO PERTENECE A NINGUNA MICRORED                                                                     ",{"$f":"CONCATENATE(J10,K10,\" - \",L10)","v":"0000 - NO PERTENECE A NINGUNA MICRORED                                                                     "},null,"000000000","(All)","07","00",null,null,{"$f":"CONCATENATE(Q10,R10)","v":"0700"},{"$f":"CONCATENATE(O10,\" - \",P10)","v":"000000000 - (All)"},null,"00","(All)",{"$f":"CONCATENATE(X10,\" - \",Y10)","v":"00 - (All)"},null,"01","00","(All)",{"$f":"CONCATENATE(AB10,AC10)","v":"0100"},{"$f":"CONCATENATE(AB10,AC10,\" - \",AD10)","v":"0100 - (All)"},null,"COD_RED","DESC_RED","CONCATENAR"]
[null,null,null,"02-Febrero",null,"02","CUSCO NORTE","02 - CUSCO NORTE",null,"00","99","(All)",{"$f":"CONCATENATE(J11,K11,\" - \",L11)","v":"0099 - (All)"},null,"000002289","HOSPITAL REGIONAL CUSCO","07","00","01","01",{"$f":"CONCATENATE(Q11,R11)","v":"0700"},"000002289 - HOSPITAL REGIONAL CUSCO",null,"01","CUSCO",{"$f":"CONCATENATE(X11,\" - \",Y11)","v":"01 - CUSCO"},null,"01","01","CUSCO",{"$f":"CONCATENATE(AB11,AC11)","v":"0101"},{"$f":"CONCATENATE(AB11,AC11,\" - \",AD11)","v":"0101 - CUSCO"},null,1129,"UE - SALUD CANAS - CANCHIS - ESPINAR",{"$f":"CONCATENATE(AH11,\" - \",AI11)","v":"1129 - UE - SALUD CANAS - CANCHIS - ESPINAR"}]
[null,null,null,"03-Marzo",null,"03","LA CONVENCION","03 - LA CONVENCION",null,"01","00","HOSPITAL","0100 - HOSPITAL",null,"000002305","HOSPITAL ANTONIO LORENA","07","00","01","06",{"$f":"CONCATENATE(Q12,R12)","v":"0700"},"000002305 - HOSPITAL ANTONIO LORENA",null,"02","ACOMAYO",{"$f":"CONCATENATE(X12,\" - \",Y12)","v":"02 - ACOMAYO"},null,"01","02","CCORCA","0102","0102 - CCORCA",null,1130,"UE - HOSPITAL REGIONAL CUSCO",{"$f":"CONCATENATE(AH12,\" - \",AI12)","v":"1130 - UE - HOSPITAL REGIONAL CUSCO"}]
[null,null,null,"04-Abril",null,"04","CANAS-CANCHIS-ESPINAR","04 - CANAS-CANCHIS-ESPINAR",null,"01","03","PARURO                                                                                              ","0103 - PARURO                                                                                              ",null,"999999999","(All)","07","99",null,null,{"$f":"CONCATENATE(Q13,R13)","v":"0799"},"999999999 - (All)",null,"03","ANTA","03 - ANTA",null,"01","03","POROY","0103","0103 - POROY",null,1169,"UE - HOSPITAL ANTONIO LORENA","1169 - UE - HOSPITAL ANTONIO LORENA"]
[null,null,null,"05-Mayo",null,"05","KIMBIRI PICHARI","05 - KIMBIRI PICHARI",null,"01","06","PAUCARTAMBO                                                                                         ","0106 - PAUCARTAMBO                                                                                         ",null,"000025210","TUPAC AMARU","01","00","01","05","0100","000025210 - TUPAC AMARU",null,"04","CALCA","04 - CALCA",null,"01","04","SAN JERONIMO","0104","0104 - SAN JERONIMO",null,1170,"UE - SALUD LA CONVENCION","1170 - UE - SALUD LA CONVENCION"]
[null,null,null,"06-Junio",null,"06","CHUMBIVILCAS","06 - CHUMBIVILCAS",null,"01","12","URCOS                                                                                               ","0112 - URCOS                                                                                               ",null,"000000000","(All)","01","16",null,null,{"$f":"CONCATENATE(Q15,R15)","v":"0116"},"000000000 - (All)",null,"05","CANAS","05 - CANAS",null,"01","05","SAN SEBASTIAN","0105","0105 - SAN SEBASTIAN",null,1322,"UE - SALUD CUSCO SUR","1322 - UE - SALUD CUSCO SUR"]
[null,null,null,"07-Julio",null,"07","HOSPITALES III",{"$f":"CONCATENATE(F16,\" - \",G16)","v":"07 - HOSPITALES III"},null,"01","13","ACOMAYO                                                                                             ","0113 - ACOMAYO                                                                                             ",null,"000002300","SAN JERONIMO                                                                                        ","01","16","01","04","0116","000002300 - SAN JERONIMO                                                                                        ",null,"06","CANCHIS","06 - CANCHIS",null,"01","06","SANTIAGO","0106","0106 - SANTIAGO",null,1347,"UE - SALUD KIMBIRI PICHARI","1347 - UE - SALUD KIMBIRI PICHARI"]
[null,null,null,"08-Agosto",null,"99","(All)",{"$f":"CONCATENATE(F17,\" - \",G17)","v":"99 - (All)"},null,"01","15","OCONGATE                                                                                            ","0115 - OCONGATE                                                                                            ",null,"000002301","SAN SEBASTIAN                                                                                       ","01","16","01","05","0116","000002301 - SAN SEBASTIAN                                                                                       ",null,"07","CHUMBIVILCAS","07 - CHUMBIVILCAS",null,"01","07","SAYLLA","0107","0107 - SAYLLA",null,1348,"UE - SALUD CUSCO NORTE","1348 - UE - SALUD CUSCO NORTE"]
[null,null,null,"09-Setiembre",null,null,null,null,null,"01","16","CUSCO","0116 - CUSCO",null,"000002303","SANTA ROSA                                                                                          ","01","16","01","05","0116","000002303 - SANTA ROSA                                                                                          ",null,"08","ESPINAR","08 - ESPINAR",null,"01","08","WANCHAQ","0108","0108 - WANCHAQ",null,1547,"UE - HOSPITAL ESPINAR","1547 - UE - HOSPITAL ESPINAR"]
[null,null,null,"10-Octubre",null,null,null,null,null,"01","99","(All)","0199 - (All)",null,"000002314","SAYLLA                                                                                              ","01","16","01","07","0116","000002314 - SAYLLA                                                                                              ",null,"09","LA CONVENCION","09 - LA CONVENCION",null,"02","00","(All)","0200","0200 - (All)",null,1625,"UE - HOSPITAL SICUANI","1625 - UE - HOSPITAL SICUANI"]
[null,null,null,"11-Noviembre",null,null,null,null,null,"02","01","BELEMPAMPA                                                                                          ","0201 - BELEMPAMPA                                                                                          ",null,"000002323","RONDOCAN                                                                                            ","01","16","02","06","0116","000002323 - RONDOCAN                                                                                            ",null,"10","PARURO","10 - PARURO",null,"02","01","ACOMAYO","0201","0201 - ACOMAYO",null,1626,"UE - HOSPITAL QUILLABAMBA","1626 - UE - HOSPITAL QUILLABAMBA"]
[null,null,null,"12-Diciembre",null,null,null,null,null,"02","02","WANCHAQ                                                                                             ","0202 - WANCHAQ                                                                                             ",null,"000007699","CONCHACALLE                                                                                         ","01","16","01","04","0116","000007699 - CONCHACALLE                                                                                         ",null,"11","PAUCARTAMBO","11 - PAUCARTAMBO",null,"02","02","ACOPIA","0202","0202 - ACOPIA",null,1666,"UE - SALUD CHUMBIVILCAS","1666 - UE - SALUD CHUMBIVILCAS"]
[null,null,null,null,null,null,null,null,null,"02","03","ANTA                                                                                                ","0203 - ANTA                                                                                                ",null,"000010065","ESSALUD-SAN SEBASTIAN","01","16","01","05","0116","000010065 - ESSALUD-SAN SEBASTIAN",null,"12","QUISPICANCHI","12 - QUISPICANCHI",null,"02","03","ACOS","0203","0203 - ACOS",null,"7777","(All)",{"$f":"CONCATENATE(AH22,\" - \",AI22)","v":"7777 - (All)"}]
[null,null,null,null,null,null,null,null,null,"02","04","LIMATAMBO                                                                                           ","0204 - LIMATAMBO                                                                                           ",null,"000011743","SANIDAD-SANTA ROSA PNP","01","16","01","05","0116","000011743 - SANIDAD-SANTA ROSA PNP",null,"13","URUBAMBA","13 - URUBAMBA",null,"02","04","MOSOC LLACTA","0204","0204 - MOSOC LLACTA"]
[null,null,null,null,null,null,null,null,null,"02","05","PISAC                                                                                               ","0205 - PISAC                                                                                               ",null,"000026181","MENTAL SAN SEBASTIAN","01","16","01","05","0116","000026181 - MENTAL SAN SEBASTIAN",null,null,null,null,null,"02","05","POMACANCHI","0205","0205 - POMACANCHI"]
[null,null,null,null,null,null,null,null,null,"02","06","CALCA                                                                                               ","0206 - CALCA                                                                                               ",null,"000030727","PATRÓN SAN SEBASTIAN","01","16","01","04",{"$f":"CONCATENATE(Q25,R25)","v":"0116"},"000030727 - PATRÓN SAN SEBASTIAN",null,null,null,null,null,"02","06","RONDOCAN","0206","0206 - RONDOCAN"]
[null,null,null,null,null,null,null,null,null,"02","07","URUBAMBA                                                                                            ","0207 - URUBAMBA                                                                                            ",null,"000000000","(All)","01","03",null,null,{"$f":"CONCATENATE(Q26,R26)","v":"0103"},"000000000 - (All)",null,null,null,null,null,"02","07","SANGARARA","0207","0207 - SANGARARA"]
[null,null,null,null,null,null,null,null,null,"02","08","YANATILE                                                                                            ","0208 - YANATILE                                                                                            ",null,"000002499","PARURO                                                                                              ","01","03",10,"01","0103","000002499 - PARURO                                                                                              ",null,null,null,null,null,"03","00","(All)","0300","0300 - (All)"]
[null,null,null,null,null,null,null,null,null,"02","09","SIETE CUARTONES                                                                                     ","0209 - SIETE CUARTONES                                                                                     ",null,"000002500","ACCHA                                                                                               ","01","03",10,"02","0103","000002500 - ACCHA                                                                                               ",null,null,null,null,null,"03","01","ANTA","0301","0301 - ANTA"]
[null,null,null,null,null,null,null,null,null,"02","99","(All)","0299 - (All)",null,"000002501","CCAPI                                                                                               ","01","03",10,"03","0103","000002501 - CCAPI                                                                                               ",null,null,null,null,null,"03","02","ANCAHUASI","0302","0302 - ANCAHUASI"]
[null,null,null,null,null,null,null,null,null,"03","00","HOSPITAL","0300 - HOSPITAL",null,"000002502","CCOYABAMBA                                                                                          ","01","03",10,"03","0103","000002502 - CCOYABAMBA                                                                                          ",null,null,null,null,null,"03","03","CACHIMAYO","0303","0303 - CACHIMAYO"]
[null,null,null,null,null,null,null,null,null,"03","01","SANTA ANA                                                                                           ","0301 - SANTA ANA                                                                                           ",null,"000002503","COLCHA                                                                                              ","01","03",10,"04","0103","000002503 - COLCHA                                                                                              ",null,null,null,null,null,"03","04","CHINCHAYPUJIO","0304","0304 - CHINCHAYPUJIO"]
[null,null,null,null,null,null,null,null,null,"03","02","MARANURA                                                                                            ","0302 - MARANURA                                                                                            ",null,"000002504","HUANOQUITE                                                                                          ","01","03",10,"05","0103","000002504 - HUANOQUITE                                                                                          ",null,null,null,null,null,"03","05","HUAROCONDO","0305","0305 - HUAROCONDO"]
[null,null,null,null,null,null,null,null,null,"03","03","QUELLOUNO                                                                                           ","0303 - QUELLOUNO                                                                                           ",null,"000002505","OMACHA                                                                                              ","01","03",10,"06","0103","000002505 - OMACHA                                                                                              ",null,null,null,null,null,"03","06","LIMATAMBO","0306","0306 - LIMATAMBO"]
[null,null,null,null,null,null,null,null,null,"03","04","KITENI                                                                                              ","0304 - KITENI                                                                                              ",null,"000002506","ANTAPALLPA                                                                                          ","01","03",10,"06","0103","000002506 - ANTAPALLPA                                                                                          ",null,null,null,null,null,"03","07","MOLLEPATA","0307","0307 - MOLLEPATA"]
[null,null,null,null,null,null,null,null,null,"03","05","KAMISEA                                                                                             ","0305 - KAMISEA                                                                                             ",null,"000002507","PACCARECTAMBO                                                                                       ","01","03",10,"07","0103","000002507 - PACCARECTAMBO                                                                                       ",null,null,null,null,null,"03","08","PUCYURA","0308","0308 - PUCYURA"]
[null,null,null,null,null,null,null,null,null,"03","06","PUCYURA                                                                                             ","0306 - PUCYURA                                                                                             ",null,"000002509","YAURISQUE                                                                                           ","01","03",10,"09","0103","000002509 - YAURISQUE                                                                                           ",null,null,null,null,null,"03","09","ZURITE","0309","0309 - ZURITE"]
[null,null,null,null,null,null,null,null,null,"03","99","(All)","0399 - (All)",null,"000006978","CCOCHIRIHUAY                                                                                        ","01","03",10,"04","0103","000006978 - CCOCHIRIHUAY                                                                                        ",null,null,null,null,null,"04","00","(All)","0400","0400 - (All)"]
[null,null,null,null,null,null,null,null,null,"04","00","HOSPITAL","0400 - HOSPITAL",null,"000007147","HUASQUILLAY                                                                                         ","01","03",10,"06","0103","000007147 - HUASQUILLAY                                                                                         ",null,null,null,null,null,"04","01","CALCA","0401","0401 - CALCA"]
[null,null,null,null,null,null,null,null,null,"04","01","YANAOCA                                                                                             ","0401 - YANAOCA                                                                                             ",null,"000012924","SAHUA SAHUA                                                                                         ","01","03",10,"06","0103","000012924 - SAHUA SAHUA                                                                                         ",null,null,null,null,null,"04","02","COYA","0402","0402 - COYA"]
[null,null,null,null,null,null,null,null,null,"04","02","EL DESCANSO                                                                                         ","0402 - EL DESCANSO                                                                                         ",null,"000000000","(All)","01","06",null,null,"0106","000000000 - (All)",null,null,null,null,null,"04","03","LAMAY","0403","0403 - LAMAY"]
[null,null,null,null,null,null,null,null,null,"04","03","COMBAPATA                                                                                           ","0403 - COMBAPATA                                                                                           ",null,"000002510","PAUCARTAMBO                                                                                         ","01","06",11,"01","0106","000002510 - PAUCARTAMBO                                                                                         ",null,null,null,null,null,"04","04","LARES","0404","0404 - LARES"]
[null,null,null,null,null,null,null,null,null,"04","04","TECHO OBRERO                                                                                        ","0404 - TECHO OBRERO                                                                                        ",null,"000002511","MOLLOMARCA                                                                                          ","01","06",11,"01","0106","000002511 - MOLLOMARCA                                                                                          ",null,null,null,null,null,"04","05","PISAC","0405","0405 - PISAC"]
[null,null,null,null,null,null,null,null,null,"04","05","PAMPAPHALLA                                                                                         ","0405 - PAMPAPHALLA                                                                                         ",null,"000002512","CAICAY                                                                                              ","01","06",11,"02","0106","000002512 - CAICAY                                                                                              ",null,null,null,null,null,"04","06","SAN SALVADOR","0406","0406 - SAN SALVADOR"]
[null,null,null,null,null,null,null,null,null,"04","06","YAURI                                                                                               ","0406 - YAURI                                                                                               ",null,"000002513","HUASAC                                                                                              ","01","06",11,"02","0106","000002513 - HUASAC                                                                                              ",null,null,null,null,null,"04","07","TARAY","0407","0407 - TARAY"]
[null,null,null,null,null,null,null,null,null,"04","99","(All)","0499 - (All)",null,"000002514","CHALLABAMBA                                                                                         ","01","06",11,"03","0106","000002514 - CHALLABAMBA                                                                                         ",null,null,null,null,null,"04","08","YANATILE","0408","0408 - YANATILE"]
[null,null,null,null,null,null,null,null,null,"05","00","HOSPITAL","0500 - HOSPITAL",null,"000002516","COLQUEPATA                                                                                          ","01","06",11,"04","0106","000002516 - COLQUEPATA                                                                                          ",null,null,null,null,null,"05","00","(All)","0500","0500 - (All)"]
[null,null,null,null,null,null,null,null,null,"05","01","KIMBIRI                                                                                             ","0501 - KIMBIRI                                                                                             ",null,"000002517","PICHIHUA COLQUEPATA                                                                                 ","01","06",11,"04","0106","000002517 - PICHIHUA COLQUEPATA                                                                                 ",null,null,null,null,null,"05","01","YANAOCA","0501","0501 - YANAOCA"]
[null,null,null,null,null,null,null,null,null,"05","02","PICHARI                                                                                             ","0502 - PICHARI                                                                                             ",null,"000002518","VIZCOCHONI                                                                                          ","01","06",11,"04","0106","000002518 - VIZCOCHONI                                                                                          ",null,null,null,null,null,"05","02","CHECCA","0502","0502 - CHECCA"]
[null,null,null,null,null,null,null,null,null,"05","99","(All)","0599 - (All)",null,"000002519","AYRE                                                                                                ","01","06",11,"04","0106","000002519 - AYRE                                                                                                ",null,null,null,null,null,"05","03","KUNTURKANKI","0503","0503 - KUNTURKANKI"]
[null,null,null,null,null,null,null,null,null,"06","00","HOSPITAL","0600 - HOSPITAL",null,"000002520","HUANCARANI                                                                                          ","01","06",11,"05","0106","000002520 - HUANCARANI                                                                                          ",null,null,null,null,null,"05","04","LANGUI","0504","0504 - LANGUI"]
[null,null,null,null,null,null,null,null,null,"06","09","SANTO TOMAS                                                                                         ","0609 - SANTO TOMAS                                                                                         ",null,"000002521","PILCOPATA                                                                                           ","01","06",11,"06","0106","000002521 - PILCOPATA                                                                                           ",null,null,null,null,null,"05","05","LAYO","0505","0505 - LAYO"]
[null,null,null,null,null,null,null,null,null,"06","01","LIVITACA                                                                                            ","0601 - LIVITACA                                                                                            ",null,"000002522","PATRIA                                                                                              ","01","06",11,"06","0106","000002522 - PATRIA                                                                                              ",null,null,null,null,null,"05","06","PAMPAMARCA","0506","0506 - PAMPAMARCA"]
[null,null,null,null,null,null,null,null,null,"06","99","(All)","0699 - (All)",null,"000006979","TOCRA                                                                                               ","01","06",11,"04","0106","000006979 - TOCRA                                                                                               ",null,null,null,null,null,"05","07","QUEHUE","0507","0507 - QUEHUE"]
[null,null,null,null,null,null,null,null,null,"07","00","HOSPITAL","0700 - HOSPITAL",null,"000010077","ESSALUD-PAUCARTAMBO","01","06",11,"01","0106","000010077 - ESSALUD-PAUCARTAMBO",null,null,null,null,null,"05","08","TUPAC AMARU","0508","0508 - TUPAC AMARU"]
[null,null,null,null,null,null,null,null,null,"99","99","(All)",{"$f":"CONCATENATE(J55,K55,\" - \",L55)","v":"9999 - (All)"},null,"000033777","MENTAL COMUNITARIO VIRGEN DEL ROSARIO","01","06",11,"01","0106","000033777 - MENTAL COMUNITARIO VIRGEN DEL ROSARIO",null,null,null,null,null,"06","00","(All)","0600","0600 - (All)"]
[null,null,null,null,null,null,null,null,null,null,null,null,null,null,"000000000","(All)","01","12",null,null,"0112","000000000 - (All)",null,null,null,null,null,"06","01","SICUANI","0601","0601 - SICUANI"]
[null,null,null,null,null,null,null,null,null,null,null,null,null,null,"000002523","URCOS                                                                                               ","01","12",12,"01","0112","000002523 - URCOS                                                                                               ",null,null,null,null,null,"06","02","CHECACUPE","0602","0602 - CHECACUPE"]
[null,null,null,null,null,null,null,null,null,null,null,null,null,null,"000002525","ANDAHUAYLILLAS                                                                                      ","01","12",12,"02","0112","000002525 - ANDAHUAYLILLAS                                                                                      ",null,null,null,null,null,"06","03","COMBAPATA","0603","0603 - COMBAPATA"]
[null,null,null,null,null,null,null,null,null,null,null,null,null,null,"000002530","CUSIPATA                                                                                            ","01","12",12,"06","0112","000002530 - CUSIPATA                                                                                            ",null,null,null,null,null,"06","04","MARANGANI","0604","0604 - MARANGANI"]
[null,null,null,null,null,null,null,null,null,null,null,null,null,null,"000002532","HUARO                                                                                               ","01","12",12,"07","0112","000002532 - HUARO                                                                                               ",null,null,null,null,null,"06","05","PITUMARCA","0605","0605 - PITUMARCA"]
[null,null,null,null,null,null,null,null,null,null,null,null,null,null,"000002533","URPAY                                                                                               ","01","12",12,"07","0112","000002533 - URPAY                                                                                               ",null,null,null,null,null,"06","06","SAN PABLO","0606","0606 - SAN PABLO"]
[null,null,null,null,null,null,null,null,null,null,null,null,null,null,"000002534","LUCRE                                                                                               ","01","12",12,"08","0112","000002534 - LUCRE                                                                                               ",null,null,null,null,null,"06","07","SAN PEDRO","0607","0607 - SAN PEDRO"]
[null,null,null,null,null,null,null,null,null,null,null,null,null,null,"000002537","OROPESA                                                                                             ","01","12",12,11,"0112","000002537 - OROPESA                                                                                             ",null,null,null,null,null,"06","08","TINTA","0608","0608 - TINTA"]
[null,null,null,null,null,null,null,null,null,null,null,null,null,null,"000002538","QUIQUIJANA                                                                                          ","01","12",12,12,"0112","000002538 - QUIQUIJANA                                                                                          ",null,null,null,null,null,"07","00","(All)","0700","0700 - (All)"]
[null,null,null,null,null,null,null,null,null,null,null,null,null,null,"000002539","CCOLCA","01","12",12,12,"0112","000002539 - CCOLCA",null,null,null,null,null,"07","01","SANTO TOMAS","0701","0701 - SANTO TOMAS"]
[null,null,null,null,null,null,null,null,null,null,null,null,null,null,"000006980","CHILLIHUANI                                                                                         ","01","12",12,"06","0112","000006980 - CHILLIHUANI                                                                                         ",null,null,null,null,null,"07","02","CAPACMARCA","0702","0702 - CAPACMARCA"]
[null,null,null,null,null,null,null,null,null,null,null,null,null,null,"000008911","HUARA HUARA                                                                                         ","01","12",12,"05","0112","000008911 - HUARA HUARA                                                                                         ",null,null,null,null,null,"07","03","CHAMACA","0703","0703 - CHAMACA"]
[null,null,null,null,null,null,null,null,null,null,null,null,null,null,"000011747","SANIDAD-PUCUTO PNP","01","12",12,"07","0112","000011747 - SANIDAD-PUCUTO PNP",null,null,null,null,null,"07","04","COLQUEMARCA","0704","0704 - COLQUEMARCA"]
[null,null,null,null,null,null,null,null,null,null,null,null,null,null,"000026385","ESSALUD-URCOS","01","12",12,"01","0112","000026385 - ESSALUD-URCOS",null,null,null,null,null,"07","05","LIVITACA","0705","0705 - LIVITACA"]
[null,null,null,null,null,null,null,null,null,null,null,null,null,null,"000030708","MENTAL COMUNITARIO HUARO","01","12",12,"07","0112","000030708 - MENTAL COMUNITARIO HUARO",null,null,null,null,null,"07","06","LLUSCO","0706","0706 - LLUSCO"]
[null,null,null,null,null,null,null,null,null,null,null,null,null,null,"000000000","(All)","01","13",null,null,"0113","000000000 - (All)",null,null,null,null,null,"07","07","QUIÑOTA","0707","0707 - QUIÑOTA"]
[null,null,null,null,null,null,null,null,null,null,null,null,null,null,"000002317","ACOMAYO                                                                                             ","01","13","02","01","0113","000002317 - ACOMAYO                                                                                             ",null,null,null,null,null,"07","08","VELILLE","0708","0708 - VELILLE"]
[null,null,null,null,null,null,null,null,null,null,null,null,null,null,"000002318","ACOPIA                                                                                              ","01","13","02","02","0113","000002318 - ACOPIA                                                                                              ",null,null,null,null,null,"08","00","(All)","0800","0800 - (All)"]
[null,null,null,null,null,null,null,null,null,null,null,null,null,null,"000002319","ACOS                                                                                                ","01","13","02","03","0113",{"$f":"CONCATENATE(O74,\" - \",P74)","v":"000002319 - ACOS                                                                                                "},null,null,null,null,null,"08","01","ESPINAR","0801","0801 - ESPINAR"]
[null,null,null,null,null,null,null,null,null,null,null,null,null,null,"000002321","CENTRO DE SALUD POMACANCHI","01","13","02","05","0113","000002321 - CENTRO DE SALUD POMACANCHI",null,null,null,null,null,"08","02","CONDOROMA",{"$f":"CONCATENATE(AB75,AC75)","v":"0802"},{"$f":"CONCATENATE(AB75,AC75,\" - \",AD75)","v":"0802 - CONDOROMA"}]
[null,null,null,null,null,null,null,null,null,null,null,null,null,null,"000002322","SAN JUAN DE POMACANCHI                                                                              ","01","13","02","05","0113","000002322 - SAN JUAN DE POMACANCHI                                                                              ",null,null,null,null,null,"08","03","COPORAQUE","0803","0803 - COPORAQUE"]
[null,null,null,null,null,null,null,null,null,null,null,null,null,null,"000002324","PUESTO DE SALUD SANGARARA","01","13","02","07","0113","000002324 - PUESTO DE SALUD SANGARARA",null,null,null,null,null,"08","04","OCORURO","0804","0804 - OCORURO"]
[null,null,null,null,null,null,null,null,null,null,null,null,null,null,"000002325","PUESTO DE SALUD MARCACONGA","01","13","02","07","0113","000002325 - PUESTO DE SALUD MARCACONGA",null,null,null,null,null,"08","05","PALLPATA","0805","0805 - PALLPATA"]
[null,null,null,null,null,null,null,null,null,null,null,null,null,null,"000002508","PILLPINTO                                                                                           ","01","13",10,"08","0113","000002508 - PILLPINTO                                                                                           ",null,null,null,null,null,"08","06","PICHIGUA","0806","0806 - PICHIGUA"]
[null,null,null,null,null,null,null,null,null,null,null,null,null,null,"000010076","ESSALUD-ACOMAYO","01","13","02","01","0113","000010076 - ESSALUD-ACOMAYO",null,null,null,null,null,"08","07","SUYCKUTAMBO","0807","0807 - SUYCKUTAMBO"]
[null,null,null,null,null,null,null,null,null,null,null,null,null,null,"000012926","SANTA  LUCIA                                                                                        ","01","13","02","05","0113","000012926 - SANTA  LUCIA                                                                                        ",null,null,null,null,null,"08","08","ALTO PICHIGUA","0808","0808 - ALTO PICHIGUA"]
[null,null,null,null,null,null,null,null,null,null,null,null,null,null,"000000000","(All)","01","15",null,null,"0115","000000000 - (All)",null,null,null,null,null,"09","00","(All)","0900","0900 - (All)"]
[null,null,null,null,null,null,null,null,null,null,null,null,null,null,"000002524","PAMPACAMARA                                                                                         ","01","15",12,"05","0115","000002524 - PAMPACAMARA                                                                                         ",null,null,null,null,null,"09","01","SANTA ANA","0901","0901 - SANTA ANA"]
[null,null,null,null,null,null,null,null,null,null,null,null,null,null,"000002526","QUINCE MIL","01","15",12,"03","0115","000002526 - QUINCE MIL",null,null,null,null,null,"09","02","ECHARATE","0902","0902 - ECHARATE"]
[null,null,null,null,null,null,null,null,null,null,null,null,null,null,"000002527","CCARHUAYO","01","15",12,"04","0115","000002527 - CCARHUAYO",null,null,null,null,null,"09","03","HUAYOPATA","0903","0903 - HUAYOPATA"]
[null,null,null,null,null,null,null,null,null,null,null,null,null,null,"000002528","CCATCCA                                                                                             ","01","15",12,"05","0115","000002528 - CCATCCA                                                                                             ",null,null,null,null,null,"09","04","MARANURA","0904","0904 - MARANURA"]
[null,null,null,null,null,null,null,null,null,null,null,null,null,null,"000002529","KCAURY                                                                                              ","01","15",12,"05","0115","000002529 - KCAURY                                                                                              ",null,null,null,null,null,"09","05","OCOBAMBA","0905","0905 - OCOBAMBA"]
[null,null,null,null,null,null,null,null,null,null,null,null,null,null,"000002535","MARCAPATA                                                                                           ","01","15",12,"09","0115","000002535 - MARCAPATA                                                                                           ",null,null,null,null,null,"09","06","QUELLOUNO","0906","0906 - QUELLOUNO"]
[null,null,null,null,null,null,null,null,null,null,null,null,null,null,"000002536","OCONGATE                                                                                            ","01","15",12,10,"0115","000002536 - OCONGATE                                                                                            ",null,null,null,null,null,"09","07","KIMBIRI","0907","0907 - KIMBIRI"]
[null,null,null,null,null,null,null,null,null,null,null,null,null,null,"000006977","TINKI                                                                                               ","01","15",12,10,{"$f":"CONCATENATE(Q90,R90)","v":"0115"},"000006977 - TINKI                                                                                               ",null,null,null,null,null,"09","08","SANTA TERESA","0908","0908 - SANTA TERESA"]
[null,null,null,null,null,null,null,null,null,null,null,null,null,null,"000007110","INCACANCHA                                                                                          ","01","15",12,"09","0115","000007110 - INCACANCHA                                                                                          ",null,null,null,null,null,"09","09","VILCABAMBA","0909","0909 - VILCABAMBA"]
[null,null,null,null,null,null,null,null,null,null,null,null,null,null,"000012931","CHICHINA                                                                                            ","01","15",12,"05","0115","000012931 - CHICHINA                                                                                            ",null,null,null,null,null,"09","10","PICHARI","0910","0910 - PICHARI"]
[null,null,null,null,null,null,null,null,null,null,null,null,null,null,"000016335","CCAPANA                                                                                             ","01","15",12,"05","0115","000016335 - CCAPANA                                                                                             ",null,null,null,null,null,"09","11","INKAWASI                                ","0911","0911 - INKAWASI                                "]
[null,null,null,null,null,null,null,null,null,null,null,null,null,null,"999999999","(All)","01","99",null,null,"0199","999999999 - (All)",null,null,null,null,null,"09","12","VILLA VIRGEN","0912","0912 - VILLA VIRGEN"]
[null,null,null,null,null,null,null,null,null,null,null,null,null,null,"000000000","(All)","02","01",null,null,"0201","000000000 - (All)",null,null,null,null,null,"09","13","VILLA KINTIARINA","0913","0913 - VILLA KINTIARINA"]
[null,null,null,null,null,null,null,null,null,null,null,null,null,null,"000002292","INDEPENDENCIA                                                                                       ","02","01","01","01","0201","000002292 - INDEPENDENCIA                                                                                       ",null,null,null,null,null,"09","14","MEGANTONI","0914","0914 - MEGANTONI"]
[null,null,null,null,null,null,null,null,null,null,null,null,null,null,"000002297","CCORCCA                                                                                             ","02","01","01","02","0201","000002297 - CCORCCA                                                                                             ",null,null,null,null,null,"09","15","KUMPIRUSHIATO","0915","0915 - KUMPIRUSHIATO"]
[null,null,null,null,null,null,null,null,null,null,null,null,null,null,"000002306","BELEMPAMPA                                                                                          ","02","01","01","06","0201","000002306 - BELEMPAMPA                                                                                          ",null,null,null,null,null,"09","16","CIELO PUNCO","0916","0916 - CIELO PUNCO"]
[null,null,null,null,null,null,null,null,null,null,null,null,null,null,"000002308","ZARZUELA ALTA                                                                                       ","02","01","01","06","0201","000002308 - ZARZUELA ALTA                                                                                       ",null,null,null,null,null,"09","17","MANITEA","0917","0917 - MANITEA"]
[null,null,null,null,null,null,null,null,null,null,null,null,null,null,"000002309","DIGNIDAD NACIONAL                                                                                   ","02","01","01","06","0201","000002309 - DIGNIDAD NACIONAL                                                                                   ",null,null,null,null,null,"09","18","UNION ASHANINKA","0918","0918 - UNION ASHANINKA"]
[null,null,null,null,null,null,null,null,null,null,null,null,null,null,"000002313","OCCOPATA                                                                                            ","02","01","01","06","0201","000002313 - OCCOPATA                                                                                            ",null,null,null,null,null,"10","00","(All)","1000","1000 - (All)"]
[null,null,null,null,null,null,null,null,null,null,null,null,null,null,"000010920","EJERCITO-QUINTA BRIGADA DE MONTAÑA","02","01","01","06","0201","000010920 - EJERCITO-QUINTA BRIGADA DE MONTAÑA",null,null,null,null,null,"10","01","PARURO","1001","1001 - PARURO"]
[null,null,null,null,null,null,null,null,null,null,null,null,null,null,"000026182","MENTAL SANTIAGO","02","01","01","06","0201","000026182 - MENTAL SANTIAGO",null,null,null,null,null,"10","02","ACCHA","1002","1002 - ACCHA"]
[null,null,null,null,null,null,null,null,null,null,null,null,null,null,"000034933","ESSALUD-SANTIAGO","02","01","01","06","0201","000034933 - ESSALUD-SANTIAGO",null,null,null,null,null,"10","03","CCAPI","1003","1003 - CCAPI"]
[null,null,null,null,null,null,null,null,null,null,null,null,null,null,"000000000","(All)","02","02",null,null,{"$f":"CONCATENATE(Q105,R105)","v":"0202"},"000000000 - (All)",null,null,null,null,null,"10","04","COLCHA","1004","1004 - COLCHA"]
[null,null,null,null,null,null,null,null,null,null,null,null,null,null,"000002302","CCORAO                                                                                              ","02","02","01","05","0202","000002302 - CCORAO                                                                                              ",null,null,null,null,null,"10","05","HUANOQUITE","1005","1005 - HUANOQUITE"]
[null,null,null,null,null,null,null,null,null,null,null,null,null,null,"000002307","MANCO CAPAC","02","02","01","06","0202","000002307 - MANCO CAPAC",null,null,null,null,null,"10","06","OMACHA","1006","1006 - OMACHA"]
[null,null,null,null,null,null,null,null,null,null,null,null,null,null,"000002310","CHOCCO                                                                                              ","02","02","01","06","0202","000002310 - CHOCCO                                                                                              ",null,null,null,null,null,"10","07","PACCARITAMBO","1007","1007 - PACCARITAMBO"]
[null,null,null,null,null,null,null,null,null,null,null,null,null,null,"000002315","WANCHAQ                                                                                             ","02","02","01","08","0202","000002315 - WANCHAQ                                                                                             ",null,null,null,null,null,"10","08","PILLPINTO","1008","1008 - PILLPINTO"]
[null,null,null,null,null,null,null,null,null,null,null,null,null,null,"000002316","TTIO                                                                                                ","02","02","01","08","0202","000002316 - TTIO                                                                                                ",null,null,null,null,null,"10","09","YAURISQUE","1009","1009 - YAURISQUE"]
[null,null,null,null,null,null,null,null,null,null,null,null,null,null,"000010041","ESSALUD-ADOLFO GUEVARA V.","02","02","01","08","0202","000010041 - ESSALUD-ADOLFO GUEVARA V.",null,null,null,null,null,"11","00","(All)","1100","1100 - (All)"]
[null,null,null,null,null,null,null,null,null,null,null,null,null,null,"000026183","ESSALUD-METROPOLITANO","02","02","01","08","0202","000026183 - ESSALUD-METROPOLITANO",null,null,null,null,null,"11","01","PAUCARTAMBO","1101","1101 - PAUCARTAMBO"]
[null,null,null,null,null,null,null,null,null,null,null,null,null,null,"000030730","PATRON SANTIAGO","02","02","01","08","0202","000030730 - PATRON SANTIAGO",null,null,null,null,null,"11","02","CAICAY","1102","1102 - CAICAY"]
[null,null,null,null,null,null,null,null,null,null,null,null,null,null,"000034419","MENTAL COMUNITARIO CUSCO","02","02","01","08","0202","000034419 - MENTAL COMUNITARIO CUSCO",null,null,null,null,null,"11","03","CHALLABAMBA","1103","1103 - CHALLABAMBA"]
[null,null,null,null,null,null,null,null,null,null,null,null,null,null,"000000000","(All)","02","03",null,null,{"$f":"CONCATENATE(Q115,R115)","v":"0203"},"000000000 - (All)",null,null,null,null,null,"11","04","COLQUEPATA","1104","1104 - COLQUEPATA"]
[null,null,null,null,null,null,null,null,null,null,null,null,null,null,"000002326","ANTA                                                                                                ","02","03","03","01","0203","000002326 - ANTA                                                                                                ",null,null,null,null,null,"11","05","HUANCARANI","1105","1105 - HUANCARANI"]
[null,null,null,null,null,null,null,null,null,null,null,null,null,null,"000002327","CHACAN                                                                                              ","02","03","03","01","0203","000002327 - CHACAN                                                                                              ",null,null,null,null,null,"11","06","KOSÑIPATA","1106","1106 - KOSÑIPATA"]
[null,null,null,null,null,null,null,null,null,null,null,null,null,null,"000002328","COMPONE                                                                                             ","02","03","03","01","0203","000002328 - COMPONE                                                                                             ",null,null,null,null,null,"12","00","(All)","1200","1200 - (All)"]
[null,null,null,null,null,null,null,null,null,null,null,null,null,null,"000002329","CONCHACALLA                                                                                         ","02","03","03","01","0203","000002329 - CONCHACALLA                                                                                         ",null,null,null,null,null,"12","01","URCOS","1201","1201 - URCOS"]
[null,null,null,null,null,null,null,null,null,null,null,null,null,null,"000002330","ANCAHUASI                                                                                           ","02","03","03","02","0203","000002330 - ANCAHUASI                                                                                           ",null,null,null,null,null,"12","02","ANDAHUAYLILLAS","1202","1202 - ANDAHUAYLILLAS"]
[null,null,null,null,null,null,null,null,null,null,null,null,null,null,"000002331","CACHIMAYO                                                                                           ","02","03","03","03","0203","000002331 - CACHIMAYO                                                                                           ",null,null,null,null,null,"12","03","CAMANTI","1203","1203 - CAMANTI"]
[null,null,null,null,null,null,null,null,null,null,null,null,null,null,"000002333","HUAROCONDO                                                                                          ","02","03","03","05","0203","000002333 - HUAROCONDO                                                                                          ",null,null,null,null,null,"12","04","CCARHUAYO","1204","1204 - CCARHUAYO"]
[null,null,null,null,null,null,null,null,null,null,null,null,null,null,"000002334","HUAYLLACOCHA                                                                                        ","02","03","03","05","0203","000002334 - HUAYLLACOCHA                                                                                        ",null,null,null,null,null,"12","05","CCATCA","1205","1205 - CCATCA"]
[null,null,null,null,null,null,null,null,null,null,null,null,null,null,"000002339","PUCYURA ANTA                                                                                        ","02","03","03","08","0203","000002339 - PUCYURA ANTA                                                                                        ",null,null,null,null,null,"12","06","CUSIPATA","1206","1206 - CUSIPATA"]
[null,null,null,null,null,null,null,null,null,null,null,null,null,null,"000002340","ZURITE                                                                                              ","02","03","03","09","0203","000002340 - ZURITE                                                                                              ",null,null,null,null,null,"12","07","HUARO","1207","1207 - HUARO"]
[null,null,null,null,null,null,null,null,null,null,null,null,null,null,"000006972","PANTIPATA                                                                                           ","02","03","03","04","0203","000006972 - PANTIPATA                                                                                           ",null,null,null,null,null,"12","08","LUCRE","1208","1208 - LUCRE"]
[null,null,null,null,null,null,null,null,null,null,null,null,null,null,"000027790","MENTAL COMUNITARIO ANTA","02","03","03","01","0203","000027790 - MENTAL COMUNITARIO ANTA",null,null,null,null,null,"12","09","MARCAPATA","1209","1209 - MARCAPATA"]
[null,null,null,null,null,null,null,null,null,null,null,null,null,null,"000029514","ESSALUD-ANTA","02","03","03","01","0203","000029514 - ESSALUD-ANTA",null,null,null,null,null,"12","10","OCONGATE","1210","1210 - OCONGATE"]
[null,null,null,null,null,null,null,null,null,null,null,null,null,null,"000035838","PARCCOTICA","02","03","03","04","0203","000035838 - PARCCOTICA",null,null,null,null,null,"12","11","OROPESA","1211","1211 - OROPESA"]
[null,null,null,null,null,null,null,null,null,null,null,null,null,null,"000036240","CHINCHAYPUJIO                                                                                       ","02","03","03","04","0203","000036240 - CHINCHAYPUJIO                                                                                       ",null,null,null,null,null,"12","12","QUIQUIJANA","1212","1212 - QUIQUIJANA"]
[null,null,null,null,null,null,null,null,null,null,null,null,null,null,"000000000","(All)","02","04",null,null,{"$f":"CONCATENATE(Q131,R131)","v":"0204"},"000000000 - (All)",null,null,null,null,null,"13","00","(All)","1300","1300 - (All)"]
[null,null,null,null,null,null,null,null,null,null,null,null,null,null,"000002336","LIMATAMBO                                                                                           ","02","04","03","06","0204","000002336 - LIMATAMBO                                                                                           ",null,null,null,null,null,"13","01","URUBAMBA","1301","1301 - URUBAMBA"]
[null,null,null,null,null,null,null,null,null,null,null,null,null,null,"000002337","PAMPACONGA                                                                                          ","02","04","03","06","0204","000002337 - PAMPACONGA                                                                                          ",null,null,null,null,null,"13","02","CHINCHERO","1302","1302 - CHINCHERO"]
[null,null,null,null,null,null,null,null,null,null,null,null,null,null,"000002338","MOLLEPATA                                                                                           ","02","04","03","07","0204","000002338 - MOLLEPATA                                                                                           ",null,null,null,null,null,"13","03","HUAYLLABAMBA","1303","1303 - HUAYLLABAMBA"]
[null,null,null,null,null,null,null,null,null,null,null,null,null,null,"000010761","URATARI                                                                                             ","02","04","03","06","0204","000010761 - URATARI                                                                                             ",null,null,null,null,null,"13","04","MACHUPICCHU","1304","1304 - MACHUPICCHU"]
[null,null,null,null,null,null,null,null,null,null,null,null,null,null,"000021061","HUAMANPATA                                                                                          ","02","04","03","07","0204","000021061 - HUAMANPATA                                                                                          ",null,null,null,null,null,"13","05","MARAS","1305","1305 - MARAS"]
[null,null,null,null,null,null,null,null,null,null,null,null,null,null,"000000000","(All)","02","05",null,null,"0205","000000000 - (All)",null,null,null,null,null,"13","06","OLLANTAYTAMBO","1306","1306 - OLLANTAYTAMBO"]
[null,null,null,null,null,null,null,null,null,null,null,null,null,null,"000002343","COYA                                                                                                ","02","05","04","02","0205",{"$f":"CONCATENATE(O138,\" - \",P138)","v":"000002343 - COYA                                                                                                "},null,null,null,null,null,"13","07","YUCAY","1307","1307 - YUCAY"]
[null,null,null,null,null,null,null,null,null,null,null,null,null,null,"000002344","LAMAY                                                                                               ","02","05","04","03","0205","000002344 - LAMAY                                                                                               ",null,null,null,null,null,"00","00","(All)",{"$f":"CONCATENATE(AB139,AC139)","v":"0000"},{"$f":"CONCATENATE(AB139,AC139,\" - \",AD139)","v":"0000 - (All)"}]
[null,null,null,null,null,null,null,null,null,null,null,null,null,null,"000002348","PISAC                                                                                               ","02","05","04","05","0205","000002348 - PISAC                                                                                               "]
[null,null,null,null,null,null,null,null,null,null,null,null,null,null,"000002349","CUYO CHICO                                                                                          ","02","05","04","05","0205","000002349 - CUYO CHICO                                                                                          "]
[null,null,null,null,null,null,null,null,null,null,null,null,null,null,"000002350","CUYO GRANDE                                                                                         ","02","05","04","05","0205","000002350 - CUYO GRANDE                                                                                         "]
[null,null,null,null,null,null,null,null,null,null,null,null,null,null,"000002351","QUELLO QUELLO                                                                                       ","02","05","04","05","0205","000002351 - QUELLO QUELLO                                                                                       "]
[null,null,null,null,null,null,null,null,null,null,null,null,null,null,"000002352","SAN SALVADOR                                                                                        ","02","05","04","06","0205","000002352 - SAN SALVADOR                                                                                        "]
[null,null,null,null,null,null,null,null,null,null,null,null,null,null,"000002353","TARAY                                                                                               ","02","05","04","07","0205","000002353 - TARAY                                                                                               "]
[null,null,null,null,null,null,null,null,null,null,null,null,null,null,"000002354","HUANCALLE                                                                                           ","02","05","04","07","0205","000002354 - HUANCALLE                                                                                           "]
[null,null,null,null,null,null,null,null,null,null,null,null,null,null,"000006975","SAYLLAFAYA                                                                                          ","02","05","04","03","0205","000006975 - SAYLLAFAYA                                                                                          "]
[null,null,null,null,null,null,null,null,null,null,null,null,null,null,"000007145","HUAMA                                                                                               ","02","05","04","03","0205","000007145 - HUAMA                                                                                               "]
[null,null,null,null,null,null,null,null,null,null,null,null,null,null,"000007146","POQUES                                                                                              ","02","05","04","03","0205","000007146 - POQUES                                                                                              "]
[null,null,null,null,null,null,null,null,null,null,null,null,null,null,"000036012","HUARQUI","02","05","04","03","0205","000036012 - HUARQUI"]
[null,null,null,null,null,null,null,null,null,null,null,null,null,null,"000036087","TIRACANCHA                                                                                          ","02","05","04","06","0205","000036087 - TIRACANCHA                                                                                          "]
[null,null,null,null,null,null,null,null,null,null,null,null,null,null,"000000000","(All)","02","06",null,null,{"$f":"CONCATENATE(Q152,R152)","v":"0206"},"000000000 - (All)"]
[null,null,null,null,null,null,null,null,null,null,null,null,null,null,"000002341","CALCA                                                                                               ","02","06","04","01","0206","000002341 - CALCA                                                                                               "]
[null,null,null,null,null,null,null,null,null,null,null,null,null,null,"000002342","AMPARAES                                                                                            ","02","06","04","04","0206","000002342 - AMPARAES                                                                                            "]
[null,null,null,null,null,null,null,null,null,null,null,null,null,null,"000002345","CCACHIN                                                                                             ","02","06","04","04","0206","000002345 - CCACHIN                                                                                             "]
[null,null,null,null,null,null,null,null,null,null,null,null,null,null,"000002346","CHOQUECANCHA                                                                                        ","02","06","04","04","0206","000002346 - CHOQUECANCHA                                                                                        "]
[null,null,null,null,null,null,null,null,null,null,null,null,null,null,"000002347","LARES                                                                                               ","02","06","04","04","0206","000002347 - LARES                                                                                               "]
[null,null,null,null,null,null,null,null,null,null,null,null,null,null,"000002361","SUYO                                                                                                ","02","06","04","04","0206","000002361 - SUYO                                                                                                "]
[null,null,null,null,null,null,null,null,null,null,null,null,null,null,"000002515","PAROBAMBA                                                                                           ","02","06",11,"03","0206","000002515 - PAROBAMBA                                                                                           "]
[null,null,null,null,null,null,null,null,null,null,null,null,null,null,"000007143","OTOCANI                                                                                             ","02","06",11,"03","0206","000007143 - OTOCANI                                                                                             "]
[null,null,null,null,null,null,null,null,null,null,null,null,null,null,"000007144","PATABAMBA                                                                                           ","02","06","04","07","0206","000007144 - PATABAMBA                                                                                           "]
[null,null,null,null,null,null,null,null,null,null,null,null,null,null,"000010069","ESSALUD-CALCA","02","06","04","01","0206","000010069 - ESSALUD-CALCA"]
[null,null,null,null,null,null,null,null,null,null,null,null,null,null,"000010759","HUARAN                                                                                              ","02","06","04","01","0206","000010759 - HUARAN                                                                                              "]
[null,null,null,null,null,null,null,null,null,null,null,null,null,null,"000010762","ACCHA ALTA - PAMPALLACTA                                                                            ","02","06","04","01","0206","000010762 - ACCHA ALTA - PAMPALLACTA                                                                            "]
[null,null,null,null,null,null,null,null,null,null,null,null,null,null,"000026273","MENTAL COMUNITARIO CALCA","02","06","04","01","0206","000026273 - MENTAL COMUNITARIO CALCA"]
[null,null,null,null,null,null,null,null,null,null,null,null,null,null,"000000000","(All)","02","07",null,null,"0207","000000000 - (All)"]
[null,null,null,null,null,null,null,null,null,null,null,null,null,null,"000002540","URUBAMBA                                                                                            ","02","07",13,"01","0207","000002540 - URUBAMBA                                                                                            "]
[null,null,null,null,null,null,null,null,null,null,null,null,null,null,"000002541","YANAHUARA                                                                                           ","02","07",13,"01","0207","000002541 - YANAHUARA                                                                                           "]
[null,null,null,null,null,null,null,null,null,null,null,null,null,null,"000002543","CHINCHERO                                                                                           ","02","07",13,"02","0207","000002543 - CHINCHERO                                                                                           "]
[null,null,null,null,null,null,null,null,null,null,null,null,null,null,"000002544","OCCOTUAN                                                                                            ","02","07",13,"02","0207","000002544 - OCCOTUAN                                                                                            "]
[null,null,null,null,null,null,null,null,null,null,null,null,null,null,"000002545","HUAYLLABAMBA                                                                                        ","02","07",13,"03","0207","000002545 - HUAYLLABAMBA                                                                                        "]
[null,null,null,null,null,null,null,null,null,null,null,null,null,null,"000002546","MACHUPICCHU                                                                                         ","02","07",13,"04","0207","000002546 - MACHUPICCHU                                                                                         "]
[null,null,null,null,null,null,null,null,null,null,null,null,null,null,"000002547","COLLPANI                                                                                            ","02","07",13,"04","0207","000002547 - COLLPANI                                                                                            "]
[null,null,null,null,null,null,null,null,null,null,null,null,null,null,"000002548","MARAS                                                                                               ","02","07",13,"05","0207","000002548 - MARAS                                                                                               "]
[null,null,null,null,null,null,null,null,null,null,null,null,null,null,"000002549","OLLANTAYTAMBO                                                                                       ","02","07",13,"06","0207","000002549 - OLLANTAYTAMBO                                                                                       "]
[null,null,null,null,null,null,null,null,null,null,null,null,null,null,"000002550","CHILLCA                                                                                            ","02","07",13,"06","0207","000002550 - CHILLCA                                                                                            "]
[null,null,null,null,null,null,null,null,null,null,null,null,null,null,"000002551","YUCAY                                                                                               ","02","07",13,"07","0207","000002551 - YUCAY                                                                                               "]
[null,null,null,null,null,null,null,null,null,null,null,null,null,null,"000006974","CAMINO INCA HUAYLLABAMBA                                                                            ","02","07",13,"04","0207","000006974 - CAMINO INCA HUAYLLABAMBA                                                                            "]
[null,null,null,null,null,null,null,null,null,null,null,null,null,null,"000010073","ESSALUD-MACHU PICCHU","02","07",13,"04","0207","000010073 - ESSALUD-MACHU PICCHU"]
[null,null,null,null,null,null,null,null,null,null,null,null,null,null,"000010758","CRUZPATA                                                                                            ","02","07",13,"05","0207","000010758 - CRUZPATA                                                                                            "]
[null,null,null,null,null,null,null,null,null,null,null,null,null,null,"000010760","PATACANCHA                                                                                          ","02","07",13,"06","0207","000010760 - PATACANCHA                                                                                          "]
[null,null,null,null,null,null,null,null,null,null,null,null,null,null,"000030666","MENTAL COMUNITARIO URUBAMBA","02","07",13,"01","0207","000030666 - MENTAL COMUNITARIO URUBAMBA"]
[null,null,null,null,null,null,null,null,null,null,null,null,null,null,"000035851","ESSALUD-URUBAMBA","02","07",13,"01","0207","000035851 - ESSALUD-URUBAMBA"]
[null,null,null,null,null,null,null,null,null,null,null,null,null,null,"000000000","(All)","02","08",null,null,{"$f":"CONCATENATE(Q184,R184)","v":"0208"},"000000000 - (All)"]
[null,null,null,null,null,null,null,null,null,null,null,null,null,null,"000002355","LA QUEBRADA                                                                                         ","02","08","04","08","0208","000002355 - LA QUEBRADA                                                                                         "]
[null,null,null,null,null,null,null,null,null,null,null,null,null,null,"000002356","CCORIMAYO                                                                                           ","02","08","04","08","0208","000002356 - CCORIMAYO                                                                                           "]
[null,null,null,null,null,null,null,null,null,null,null,null,null,null,"000002357","COLCCA YANATILE                                                                                     ","02","08","04","08","0208","000002357 - COLCCA YANATILE                                                                                     "]
[null,null,null,null,null,null,null,null,null,null,null,null,null,null,"000002358","MUYUPAY                                                                                             ","02","08","04","08","0208","000002358 - MUYUPAY                                                                                             "]
[null,null,null,null,null,null,null,null,null,null,null,null,null,null,"000002359","PUTUCUSI                                                                                            ","02","08","04","08","0208","000002359 - PUTUCUSI                                                                                            "]
[null,null,null,null,null,null,null,null,null,null,null,null,null,null,"000002360","QUESQUENTO                                                                                          ","02","08","04","08","0208","000002360 - QUESQUENTO                                                                                          "]
[null,null,null,null,null,null,null,null,null,null,null,null,null,null,"000002362","HUACHIBAMBA                                                                                         ","02","08","04","08","0208","000002362 - HUACHIBAMBA                                                                                         "]
[null,null,null,null,null,null,null,null,null,null,null,null,null,null,"000002464","VERSALLES                                                                                           ","02","08","09","05","0208","000002464 - VERSALLES                                                                                           "]
[null,null,null,null,null,null,null,null,null,null,null,null,null,null,"000002467","PUENTE SANTIAGO                                                                                     ","02","08","09","06","0208","000002467 - PUENTE SANTIAGO                                                                                     "]
[null,null,null,null,null,null,null,null,null,null,null,null,null,null,"000006971","COMBAPATA YANATILE                                                                                  ","02","08","04","08","0208","000006971 - COMBAPATA YANATILE                                                                                  "]
[null,null,null,null,null,null,null,null,null,null,null,null,null,null,"000006973","BELLAVISTA                                                                                          ","02","08","04","08","0208","000006973 - BELLAVISTA                                                                                          "]
[null,null,null,null,null,null,null,null,null,null,null,null,null,null,"000007142","CHANCAMAYO                                                                                          ","02","08","04","08","0208","000007142 - CHANCAMAYO                                                                                          "]
[null,null,null,null,null,null,null,null,null,null,null,null,null,null,"000000000","(All)","02","09",null,null,"0209","000000000 - (All)"]
[null,null,null,null,null,null,null,null,null,null,null,null,null,null,"000002290","SAN PEDRO CUSCO                                                                                     ","02","09","01","01","0209","000002290 - SAN PEDRO CUSCO                                                                                     "]
[null,null,null,null,null,null,null,null,null,null,null,null,null,null,"000002291","SIETE CUARTONES                                                                                     ","02","09","01","01","0209","000002291 - SIETE CUARTONES                                                                                     "]
[null,null,null,null,null,null,null,null,null,null,null,null,null,null,"000002293","MIRAFLORES                                                                                          ","02","09","01","01","0209","000002293 - MIRAFLORES                                                                                          "]
[null,null,null,null,null,null,null,null,null,null,null,null,null,null,"000002294","PICCHU LA RINCONADA                                                                                 ","02","09","01","01","0209","000002294 - PICCHU LA RINCONADA                                                                                 "]
[null,null,null,null,null,null,null,null,null,null,null,null,null,null,"000002295","BUENA VISTA                                                                                         ","02","09","01","01","0209",{"$f":"CONCATENATE(O202,\" - \",P202)","v":"000002295 - BUENA VISTA                                                                                         "}]
[null,null,null,null,null,null,null,null,null,null,null,null,null,null,"000002299","POROY                                                                                               ","02","09","01","03","0209","000002299 - POROY                                                                                               "]
[null,null,null,null,null,null,null,null,null,null,null,null,null,null,"999999999","(All)","02","99",null,null,"0299","999999999 - (All)"]
[null,null,null,null,null,null,null,null,null,null,null,null,null,null,"000002421","HOSPITAL QUILLABAMBA","03","00","09","01","0300","000002421 - HOSPITAL QUILLABAMBA"]
[null,null,null,null,null,null,null,null,null,null,null,null,null,null,"000000000","(All)","03","01",null,null,"0301","000000000 - (All)"]
[null,null,null,null,null,null,null,null,null,null,null,null,null,null,"000002422","HUAYANAY                                                                                            ","03","01","09","01","0301","000002422 - HUAYANAY                                                                                            "]
[null,null,null,null,null,null,null,null,null,null,null,null,null,null,"000002423","IDMA                                                                                                ","03","01","09","01","0301","000002423 - IDMA                                                                                                "]
[null,null,null,null,null,null,null,null,null,null,null,null,null,null,"000002424","POTRERO                                                                                             ","03","01","09","01","0301","000002424 - POTRERO                                                                                             "]
[null,null,null,null,null,null,null,null,null,null,null,null,null,null,"000002425","ECHARATE                                                                                            ","03","01","09","02","0301","000002425 - ECHARATE                                                                                            "]
[null,null,null,null,null,null,null,null,null,null,null,null,null,null,"000002429","CIRIALO                                                                                             ","03","01","09","02","0301","000002429 - CIRIALO                                                                                             "]
[null,null,null,null,null,null,null,null,null,null,null,null,null,null,"000002430","PAMPA CONCEPCION                                                                                    ","03","01","09","02","0301","000002430 - PAMPA CONCEPCION                                                                                    "]
[null,null,null,null,null,null,null,null,null,null,null,null,null,null,"000002433","KORIBENI                                                                                            ","03","01","09","02","0301","000002433 - KORIBENI                                                                                            "]
[null,null,null,null,null,null,null,null,null,null,null,null,null,null,"000002439","PALMA REAL                                                                                          ","03","01","09","02","0301","000002439 - PALMA REAL                                                                                          "]
[null,null,null,null,null,null,null,null,null,null,null,null,null,null,"000002446","CHACCO                                                                                              ","03","01","09","02","0301","000002446 - CHACCO                                                                                              "]
[null,null,null,null,null,null,null,null,null,null,null,null,null,null,"000002449","ICHIQUIATO                                                                                          ","03","01","09","02","0301","000002449 - ICHIQUIATO                                                                                          "]
[null,null,null,null,null,null,null,null,null,null,null,null,null,null,"000002450","SAN ANTONIO                                                                                         ","03","01","09","02","0301","000002450 - SAN ANTONIO                                                                                         "]
[null,null,null,null,null,null,null,null,null,null,null,null,null,null,"000002451","CHAHUARES                                                                                           ","03","01","09","02","0301","000002451 - CHAHUARES                                                                                           "]
[null,null,null,null,null,null,null,null,null,null,null,null,null,null,"000008910","SANTA ANA                                                                                           ","03","01","09","01","0301","000008910 - SANTA ANA                                                                                           "]
[null,null,null,null,null,null,null,null,null,null,null,null,null,null,"000010062","ESSALUD-QUILLABAMBA","03","01","09","01","0301","000010062 - ESSALUD-QUILLABAMBA"]
[null,null,null,null,null,null,null,null,null,null,null,null,null,null,"000011744","SANIDAD-QUILLABAMBA PNP","03","01","09","01","0301","000011744 - SANIDAD-QUILLABAMBA PNP"]
[null,null,null,null,null,null,null,null,null,null,null,null,null,null,"000015842","PAVAYOC                                                                                             ","03","01","09","01","0301","000015842 - PAVAYOC                                                                                             "]
[null,null,null,null,null,null,null,null,null,null,null,null,null,null,"000023721","EJERCITO-PERUANO","03","01","09","01","0301","000023721 - EJERCITO-PERUANO"]
[null,null,null,null,null,null,null,null,null,null,null,null,null,null,"000026386","MENTAL QUILLABAMBA","03","01","09","01","0301","000026386 - MENTAL QUILLABAMBA"]
[null,null,null,null,null,null,null,null,null,null,null,null,null,null,"000033273","SAN ISIDRO LABRADOR - ECHARATI","03","01","09","02","0301","000033273 - SAN ISIDRO LABRADOR - ECHARATI"]
[null,null,null,null,null,null,null,null,null,null,null,null,null,null,"000000000","(All)","03","02",null,null,"0302","000000000 - (All)"]
[null,null,null,null,null,null,null,null,null,null,null,null,null,null,"000002453","HUYRO                                                                                               ","03","02","09","03","0302","000002453 - HUYRO                                                                                               "]
[null,null,null,null,null,null,null,null,null,null,null,null,null,null,"000002454","ALFAMAYO                                                                                            ","03","02","09","03","0302","000002454 - ALFAMAYO                                                                                            "]
[null,null,null,null,null,null,null,null,null,null,null,null,null,null,"000002455","HUAYOPATA                                                                                           ","03","02","09","03","0302","000002455 - HUAYOPATA                                                                                           "]
[null,null,null,null,null,null,null,null,null,null,null,null,null,null,"000002456","AMAYBAMBA                                                                                           ","03","02","09","03","0302","000002456 - AMAYBAMBA                                                                                           "]
[null,null,null,null,null,null,null,null,null,null,null,null,null,null,"000002457","SAN PABLO HUAYOPATA                                                                                 ","03","02","09","03","0302","000002457 - SAN PABLO HUAYOPATA                                                                                 "]
[null,null,null,null,null,null,null,null,null,null,null,null,null,null,"000002458","MARANURA                                                                                            ","03","02","09","04","0302","000002458 - MARANURA                                                                                            "]
[null,null,null,null,null,null,null,null,null,null,null,null,null,null,"000002460","SANTA MARIA                                                                                         ","03","02","09","04","0302","000002460 - SANTA MARIA                                                                                         "]
[null,null,null,null,null,null,null,null,null,null,null,null,null,null,"000002461","UCHUMAYO                                                                                            ","03","02","09","04","0302","000002461 - UCHUMAYO                                                                                            "]
[null,null,null,null,null,null,null,null,null,null,null,null,null,null,"000002476","SANTA TERESA                                                                                        ","03","02","09","08","0302","000002476 - SANTA TERESA                                                                                        "]
[null,null,null,null,null,null,null,null,null,null,null,null,null,null,"000002477","SULLUCUYOC                                                                                          ","03","02","09","08","0302","000002477 - SULLUCUYOC                                                                                          "]
[null,null,null,null,null,null,null,null,null,null,null,null,null,null,"000002478","TOTORA                                                                                              ","03","02","09","08","0302","000002478 - TOTORA                                                                                              "]
[null,null,null,null,null,null,null,null,null,null,null,null,null,null,"000010075","ESSALUD-HUYRO","03","02","09","03","0302","000010075 - ESSALUD-HUYRO"]
[null,null,null,null,null,null,null,null,null,null,null,null,null,null,"000000000","(All)","03","03",null,null,"0303","000000000 - (All)"]
[null,null,null,null,null,null,null,null,null,null,null,null,null,null,"000002363","TUPAC AMARU QUELLOUNO                                                                               ","03","03","04","08","0303","000002363 - TUPAC AMARU QUELLOUNO                                                                               "]
[null,null,null,null,null,null,null,null,null,null,null,null,null,null,"000002462","OCCOBAMBA LACONVENCION                                                                              ","03","03","09","05","0303","000002462 - OCCOBAMBA LACONVENCION                                                                              "]
[null,null,null,null,null,null,null,null,null,null,null,null,null,null,"000002463","CHINGANILLA                                                                                         ","03","03","09","05","0303","000002463 - CHINGANILLA                                                                                         "]
[null,null,null,null,null,null,null,null,null,null,null,null,null,null,"000002465","QUELLOUNO                                                                                           ","03","03","09","06","0303","000002465 - QUELLOUNO                                                                                           "]
[null,null,null,null,null,null,null,null,null,null,null,null,null,null,"000002466","HUILLCAPAMPA                                                                                        ","03","03","09","06","0303","000002466 - HUILLCAPAMPA                                                                                        "]
[null,null,null,null,null,null,null,null,null,null,null,null,null,null,"000002468","SAN MARTIN                                                                                          ","03","03","09","06","0303","000002468 - SAN MARTIN                                                                                          "]
[null,null,null,null,null,null,null,null,null,null,null,null,null,null,"000008906","ESTRELLA                                                                                            ","03","03","09","06","0303","000008906 - ESTRELLA                                                                                            "]
[null,null,null,null,null,null,null,null,null,null,null,null,null,null,"000008907","MATORIATO                                                                                           ","03","03","09","06","0303","000008907 - MATORIATO                                                                                           "]
[null,null,null,null,null,null,null,null,null,null,null,null,null,null,"000008908","CHIRUMBIA                                                                                           ","03","03","09","06",{"$f":"CONCATENATE(Q248,R248)","v":"0303"},"000008908 - CHIRUMBIA                                                                                           "]
[null,null,null,null,null,null,null,null,null,null,null,null,null,null,"000008909","CHAPO BOYERO                                                                                        ","03","03","09","06","0303","000008909 - CHAPO BOYERO                                                                                        "]
[null,null,null,null,null,null,null,null,null,null,null,null,null,null,"000000000","(All)","03","04",null,null,"0304","000000000 - (All)"]
[null,null,null,null,null,null,null,null,null,null,null,null,null,null,"000002427","KITENI                                                                                              ","03","04","09","02","0304","000002427 - KITENI                                                                                              "]
[null,null,null,null,null,null,null,null,null,null,null,null,null,null,"000002431","IVOCHOTE                                                                                            ","03","04","09","02","0304","000002431 - IVOCHOTE                                                                                            "]
[null,null,null,null,null,null,null,null,null,null,null,null,null,null,"000002432","KEPASHIATO                                                                                          ","03","04","09","15","0304","000002432 - KEPASHIATO                                                                                          "]
[null,null,null,null,null,null,null,null,null,null,null,null,null,null,"000002434","MATERIATO                                                                                           ","03","04","09","15","0304","000002434 - MATERIATO                                                                                           "]
[null,null,null,null,null,null,null,null,null,null,null,null,null,null,"000002438","PACHIRI                                                                                             ","03","04","09","02","0304","000002438 - PACHIRI                                                                                             "]
[null,null,null,null,null,null,null,null,null,null,null,null,null,null,"000002440","PANGOA                                                                                              ","03","04","09","02","0304","000002440 - PANGOA                                                                                              "]
[null,null,null,null,null,null,null,null,null,null,null,null,null,null,"000002443","SANIRIATO                                                                                           ","03","04","09","02","0304","000002443 - SANIRIATO                                                                                           "]
[null,null,null,null,null,null,null,null,null,null,null,null,null,null,"000002447","KAMANQUIRIATO                                                                                       ","03","04","09","02","0304","000002447 - KAMANQUIRIATO                                                                                       "]
[null,null,null,null,null,null,null,null,null,null,null,null,null,null,"000002489","YUVENI                                                                                              ","03","04","09","09","0304","000002489 - YUVENI                                                                                              "]
[null,null,null,null,null,null,null,null,null,null,null,null,null,null,"000002493","SELVA ALEGRE                                                                                        ","03","04","09","09","0304","000002493 - SELVA ALEGRE                                                                                        "]
[null,null,null,null,null,null,null,null,null,null,null,null,null,null,"000006976","CHONTABAMBA                                                                                         ","03","04","09","09","0304","000006976 - CHONTABAMBA                                                                                         "]
[null,null,null,null,null,null,null,null,null,null,null,null,null,null,"000013068","TRIO RIO                                                                                            ","03","04","09","15","0304","000013068 - TRIO RIO                                                                                            "]
[null,null,null,null,null,null,null,null,null,null,null,null,null,null,"000013069","PUGUIENTIMARI                                                                                       ","03","04","09","15","0304","000013069 - PUGUIENTIMARI                                                                                       "]
[null,null,null,null,null,null,null,null,null,null,null,null,null,null,"000014531","ESSALUD-ECHARATE/KITENI","03","04","09","02","0304","000014531 - ESSALUD-ECHARATE/KITENI"]
[null,null,null,null,null,null,null,null,null,null,null,null,null,null,"000024296","EJERCITO-MIARIA 334","03","04","09","02",{"$f":"CONCATENATE(Q265,R265)","v":"0304"},"000024296 - EJERCITO-MIARIA 334"]
[null,null,null,null,null,null,null,null,null,null,null,null,null,null,"000024583","EJERCITO-KEPASHIATO 314","03","04","09","02",{"$f":"CONCATENATE(Q266,R266)","v":"0304"},{"$f":"CONCATENATE(O266,\" - \",P266)","v":"000024583 - EJERCITO-KEPASHIATO 314"}]
[null,null,null,null,null,null,null,null,null,null,null,null,null,null,"000000000","(All)","03","05",null,null,{"$f":"CONCATENATE(Q267,R267)","v":"0305"},"000000000 - (All)"]
[null,null,null,null,null,null,null,null,null,null,null,null,null,null,"000002426","KIRIGUETI                                                                                           ","03","05","09","14","0305","000002426 - KIRIGUETI                                                                                           "]
[null,null,null,null,null,null,null,null,null,null,null,null,null,null,"000002428","CHOCORIARI                                                                                          ","03","05","09","14","0305","000002428 - CHOCORIARI                                                                                          "]
[null,null,null,null,null,null,null,null,null,null,null,null,null,null,"000002435","MIARIA                                                                                              ","03","05","09","14","0305","000002435 - MIARIA                                                                                              "]
[null,null,null,null,null,null,null,null,null,null,null,null,null,null,"000002436","NUEVA LUZ                                                                                           ","03","05","09","14","0305","000002436 - NUEVA LUZ                                                                                           "]
[null,null,null,null,null,null,null,null,null,null,null,null,null,null,"000002437","NUEVO MUNDO                                                                                         ","03","05","09","14","0305","000002437 - NUEVO MUNDO                                                                                         "]
[null,null,null,null,null,null,null,null,null,null,null,null,null,null,"000002441","PUERTO HUALLANA                                                                                     ","03","05","09","14","0305","000002441 - PUERTO HUALLANA                                                                                     "]
[null,null,null,null,null,null,null,null,null,null,null,null,null,null,"000002442","PUERTO RICO                                                                                         ","03","05","09","14","0305","000002442 - PUERTO RICO                                                                                         "]
[null,null,null,null,null,null,null,null,null,null,null,null,null,null,"000002444","SENSA                                                                                               ","03","05","09","14","0305","000002444 - SENSA                                                                                               "]
[null,null,null,null,null,null,null,null,null,null,null,null,null,null,"000002445","TIMPIA                                                                                              ","03","05","09","14","0305","000002445 - TIMPIA                                                                                              "]
[null,null,null,null,null,null,null,null,null,null,null,null,null,null,"000002448","KAMISEA                                                                                             ","03","05","09","14","0305","000002448 - KAMISEA                                                                                             "]
[null,null,null,null,null,null,null,null,null,null,null,null,null,null,"000002452","SHIVANKORENI                                                                                        ","03","05","09","14","0305","000002452 - SHIVANKORENI                                                                                        "]
[null,null,null,null,null,null,null,null,null,null,null,null,null,null,"000013066","MONTETONI                                                                                           ","03","05","09","14","0305","000013066 - MONTETONI                                                                                           "]
[null,null,null,null,null,null,null,null,null,null,null,null,null,null,"000013067","TANGOSHIARI                                                                                         ","03","05","09","14","0305","000013067 - TANGOSHIARI                                                                                         "]
[null,null,null,null,null,null,null,null,null,null,null,null,null,null,"000015235","NUEVA VIDA                                                                                          ","03","05","09","14","0305","000015235 - NUEVA VIDA                                                                                          "]
[null,null,null,null,null,null,null,null,null,null,null,null,null,null,"000015843","CASHIRIARI                                                                                          ","03","05","09","14","0305","000015843 - CASHIRIARI                                                                                          "]
[null,null,null,null,null,null,null,null,null,null,null,null,null,null,"000015844","CAMANA                                                                                              ","03","05","09","14","0305","000015844 - CAMANA                                                                                              "]
[null,null,null,null,null,null,null,null,null,null,null,null,null,null,"000000000","(All)","03","06",null,null,"0306","000000000 - (All)"]
[null,null,null,null,null,null,null,null,null,null,null,null,null,null,"000002480","PUCYURA                                                                                             ","03","06","09","09","0306","000002480 - PUCYURA                                                                                             "]
[null,null,null,null,null,null,null,null,null,null,null,null,null,null,"000002481","CCARCCO                                                                                             ","03","06","09",11,"0306","000002481 - CCARCCO                                                                                             "]
[null,null,null,null,null,null,null,null,null,null,null,null,null,null,"000002482","INCAHUASI                                                                                           ","03","06","09",11,"0306","000002482 - INCAHUASI                                                                                           "]
[null,null,null,null,null,null,null,null,null,null,null,null,null,null,"000002484","OYARA                                                                                               ","03","06","09","09","0306","000002484 - OYARA                                                                                               "]
[null,null,null,null,null,null,null,null,null,null,null,null,null,null,"000002485","PACCAYBAMBA                                                                                         ","03","06","09",11,"0306","000002485 - PACCAYBAMBA                                                                                         "]
[null,null,null,null,null,null,null,null,null,null,null,null,null,null,"000002486","PAMPACONAS                                                                                          ","03","06","09","09","0306","000002486 - PAMPACONAS                                                                                          "]
[null,null,null,null,null,null,null,null,null,null,null,null,null,null,"000002487","CHOQUETIRA                                                                                          ","03","06","09",11,"0306","000002487 - CHOQUETIRA                                                                                          "]
[null,null,null,null,null,null,null,null,null,null,null,null,null,null,"000002490","ARMA                                                                                                ","03","06","09","09","0306","000002490 - ARMA                                                                                                "]
[null,null,null,null,null,null,null,null,null,null,null,null,null,null,"000002491","LUCMAHUAYCO                                                                                         ","03","06","09",11,"0306","000002491 - LUCMAHUAYCO                                                                                         "]
[null,null,null,null,null,null,null,null,null,null,null,null,null,null,"000002492","PALTAYBAMBA                                                                                         ","03","06","09","09","0306","000002492 - PALTAYBAMBA                                                                                         "]
[null,null,null,null,null,null,null,null,null,null,null,null,null,null,"000024637","EJERCITO-INCAHUASI 331                                                                                       ","03","06","09",11,"0306","000024637 - EJERCITO-INCAHUASI 331                                                                                       "]
[null,null,null,null,null,null,null,null,null,null,null,null,null,null,"000035520","CHANCAVINE                                                                                          ","03","06","09",12,"0306","000035520 - CHANCAVINE                                                                                          "]
[null,null,null,null,null,null,null,null,null,null,null,null,null,null,"999999999","(All)","03","99",null,null,{"$f":"CONCATENATE(Q297,R297)","v":"0399"},"999999999 - (All)"]
[null,null,null,null,null,null,null,null,null,null,null,null,null,null,"000002378","HOSPITAL SICUANI","04","00","06","01","0400","000002378 - HOSPITAL SICUANI"]
[null,null,null,null,null,null,null,null,null,null,null,null,null,null,"000007135","HOSPITAL ESPINAR","04","00","08","01","0400","000007135 - HOSPITAL ESPINAR"]
[null,null,null,null,null,null,null,null,null,null,null,null,null,null,"000000000","(All)","04","01",null,null,"0401","000000000 - (All)"]
[null,null,null,null,null,null,null,null,null,null,null,null,null,null,"000002364","YANAOCA                                                                                             ","04","01","05","01","0401","000002364 - YANAOCA                                                                                             "]
[null,null,null,null,null,null,null,null,null,null,null,null,null,null,"000002365","PONGOÑA                                                                                             ","04","01","05","01","0401","000002365 - PONGOÑA                                                                                             "]
[null,null,null,null,null,null,null,null,null,null,null,null,null,null,"000002372","PAMPAMARCA                                                                                          ","04","01","05","06","0401","000002372 - PAMPAMARCA                                                                                          "]
[null,null,null,null,null,null,null,null,null,null,null,null,null,null,"000002373","QUEHUE                                                                                              ","04","01","05","07","0401","000002373 - QUEHUE                                                                                              "]
[null,null,null,null,null,null,null,null,null,null,null,null,null,null,"000002374","HUINCHIRI                                                                                           ","04","01","05","07","0401","000002374 - HUINCHIRI                                                                                           "]
[null,null,null,null,null,null,null,null,null,null,null,null,null,null,"000002375","SURIMANA                                                                                            ","04","01","05","08","0401","000002375 - SURIMANA                                                                                            "]
[null,null,null,null,null,null,null,null,null,null,null,null,null,null,"000002376","TUNGASUCA                                                                                           ","04","01","05","08","0401","000002376 - TUNGASUCA                                                                                           "]
[null,null,null,null,null,null,null,null,null,null,null,null,null,null,"000002377","TOCCOCCORI                                                                                          ","04","01","05","08","0401","000002377 - TOCCOCCORI                                                                                          "]
[null,null,null,null,null,null,null,null,null,null,null,null,null,null,"000018241","HAMPATURA                                                                                           ","04","01","05","01","0401","000018241 - HAMPATURA                                                                                           "]
[null,null,null,null,null,null,null,null,null,null,null,null,null,null,"000032339","CCOCHAPATA                                                                                     ","04","01","05","08","0401","000032339 - CCOCHAPATA                                                                                     "]
[null,null,null,null,null,null,null,null,null,null,null,null,null,null,"000034449","CHAUPIBANDA","04","01","05","08","0401","000034449 - CHAUPIBANDA"]
[null,null,null,null,null,null,null,null,null,null,null,null,null,null,"000000000","(All)","04","02",null,null,"0402","000000000 - (All)"]
[null,null,null,null,null,null,null,null,null,null,null,null,null,null,"000002366","CHECCA                                                                                              ","04","02","05","02","0402","000002366 - CHECCA                                                                                              "]
[null,null,null,null,null,null,null,null,null,null,null,null,null,null,"000002367","CHITIBAMBA                                                                                          ","04","02","05","02","0402","000002367 - CHITIBAMBA                                                                                          "]
[null,null,null,null,null,null,null,null,null,null,null,null,null,null,"000007700","EL DESCANSO                                                                                         ","04","02","05","03","0402","000007700 - EL DESCANSO                                                                                         "]
[null,null,null,null,null,null,null,null,null,null,null,null,null,null,"000000000","(All)","04","03",null,null,"0403","000000000 - (All)"]
[null,null,null,null,null,null,null,null,null,null,null,null,null,null,"000002320","MOSOCLLACTA                                                                                         ","04","03","02","04","0403","000002320 - MOSOCLLACTA                                                                                         "]
[null,null,null,null,null,null,null,null,null,null,null,null,null,null,"000002386","COMBAPATA CANCHIS                                                                                   ","04","03","06","03","0403","000002386 - COMBAPATA CANCHIS                                                                                   "]
[null,null,null,null,null,null,null,null,null,null,null,null,null,null,"000002397","TINTA                                                                                               ","04","03","06","08","0403","000002397 - TINTA                                                                                               "]
[null,null,null,null,null,null,null,null,null,null,null,null,null,null,"000034448","CHIARA                                                                                              ","04","03","06","03","0403","000034448 - CHIARA                                                                                              "]
[null,null,null,null,null,null,null,null,null,null,null,null,null,null,"000034887","PITUMARCA                                                                                           ","04","03","06","05","0403","000034887 - PITUMARCA                                                                                           "]
[null,null,null,null,null,null,null,null,null,null,null,null,null,null,"000034929","CHECACUPE                                                                                           ","04","03","06","02","0403","000034929 - CHECACUPE                                                                                           "]
[null,null,null,null,null,null,null,null,null,null,null,null,null,null,"000000000","(All)","04","04",null,null,"0404","000000000 - (All)"]
[null,null,null,null,null,null,null,null,null,null,null,null,null,null,"000002369","LANGUI                                                                                              ","04","04","05","04","0404","000002369 - LANGUI                                                                                              "]
[null,null,null,null,null,null,null,null,null,null,null,null,null,null,"000002370","CONDEVILUYO                                                                                         ","04","04","05","04","0404","000002370 - CONDEVILUYO                                                                                         "]
[null,null,null,null,null,null,null,null,null,null,null,null,null,null,"000002371","LAYO                                                                                                ","04","04","05","05","0404","000002371 - LAYO                                                                                                "]
[null,null,null,null,null,null,null,null,null,null,null,null,null,null,"000002379","HERCCA                                                                                              ","04","04","06","01","0404","000002379 - HERCCA                                                                                              "]
[null,null,null,null,null,null,null,null,null,null,null,null,null,null,"000002380","TECHO OBRERO                                                                                        ","04","04","06","01","0404","000002380 - TECHO OBRERO                                                                                        "]
[null,null,null,null,null,null,null,null,null,null,null,null,null,null,"000002388","MARANGANI                                                                                           ","04","04","06","04","0404","000002388 - MARANGANI                                                                                           "]
[null,null,null,null,null,null,null,null,null,null,null,null,null,null,"000002389","CHECTUYOC                                                                                           ","04","04","06","04","0404",{"$f":"CONCATENATE(O330,\" - \",P330)","v":"000002389 - CHECTUYOC                                                                                           "}]
[null,null,null,null,null,null,null,null,null,null,null,null,null,null,"000002390","CCUYO                                                                                               ","04","04","06","04","0404","000002390 - CCUYO                                                                                               "]
[null,null,null,null,null,null,null,null,null,null,null,null,null,null,"000002391","OCCOBAMBA MARANGANI                                                                                 ","04","04","06","04","0404","000002391 - OCCOBAMBA MARANGANI                                                                                 "]
[null,null,null,null,null,null,null,null,null,null,null,null,null,null,"000010063","ESSALUD-SICUANI","04","04","06","01","0404","000010063 - ESSALUD-SICUANI"]
[null,null,null,null,null,null,null,null,null,null,null,null,null,null,"000024663","SANIDAD-SICUANI PNP","04","04","06","01","0404","000024663 - SANIDAD-SICUANI PNP"]
[null,null,null,null,null,null,null,null,null,null,null,null,null,null,"000000000","(All)","04","05",null,null,"0405","000000000 - (All)"]
[null,null,null,null,null,null,null,null,null,null,null,null,null,null,"000002381","QUEHUAR                                                                                             ","04","05","06","01","0405","000002381 - QUEHUAR                                                                                             "]
[null,null,null,null,null,null,null,null,null,null,null,null,null,null,"000002382","UZCUPATA                                                                                            ","04","05","06","01","0405","000002382 - UZCUPATA                                                                                            "]
[null,null,null,null,null,null,null,null,null,null,null,null,null,null,"000002383","LA FLORIDA                                                                                          ","04","05","06","01","0405","000002383 - LA FLORIDA                                                                                          "]
[null,null,null,null,null,null,null,null,null,null,null,null,null,null,"000002393","PHINAYA                                                                                             ","04","05","06","05","0405","000002393 - PHINAYA                                                                                             "]
[null,null,null,null,null,null,null,null,null,null,null,null,null,null,"000002394","SAN PABLO CANCHIS                                                                                   ","04","05","06","06","0405","000002394 - SAN PABLO CANCHIS                                                                                   "]
[null,null,null,null,null,null,null,null,null,null,null,null,null,null,"000002395","SANTA BARBARA                                                                                       ","04","05","06","06","0405","000002395 - SANTA BARBARA                                                                                       "]
[null,null,null,null,null,null,null,null,null,null,null,null,null,null,"000002396","SAN PEDRO CANCHIS                                                                                   ","04","05","06","07","0405","000002396 - SAN PEDRO CANCHIS                                                                                   "]
[null,null,null,null,null,null,null,null,null,null,null,null,null,null,"000032923","SR DE PAMPACUCHO-SICUANI","04","05","06","01","0405","000032923 - SR DE PAMPACUCHO-SICUANI"]
[null,null,null,null,null,null,null,null,null,null,null,null,null,null,"000035845","PAMPAPHALLA                                                                                         ","04","05","06","01","0405","000035845 - PAMPAPHALLA                                                                                         "]
[null,null,null,null,null,null,null,null,null,null,null,null,null,null,"000035848","MENTAL COMUNITARIO SICUANI","04","05","06","01","0405","000035848 - MENTAL COMUNITARIO SICUANI"]
[null,null,null,null,null,null,null,null,null,null,null,null,null,null,"000000000","(All)","04","06",null,null,"0406","000000000 - (All)"]
[null,null,null,null,null,null,null,null,null,null,null,null,null,null,"000002410","YAURI                                                                                               ","04","06","08","01","0406","000002410 - YAURI                                                                                               "]
[null,null,null,null,null,null,null,null,null,null,null,null,null,null,"000002411","CONDOROMA                                                                                           ","04","06","08","02","0406","000002411 - CONDOROMA                                                                                           "]
[null,null,null,null,null,null,null,null,null,null,null,null,null,null,"000002412","COPORAQUE                                                                                           ","04","06","08","03","0406","000002412 - COPORAQUE                                                                                           "]
[null,null,null,null,null,null,null,null,null,null,null,null,null,null,"000002413","URINSAYA                                                                                            ","04","06","08","03","0406","000002413 - URINSAYA                                                                                            "]
[null,null,null,null,null,null,null,null,null,null,null,null,null,null,"000002414","HUAYHUAHUASI                                                                                        ","04","06","08","03","0406","000002414 - HUAYHUAHUASI                                                                                        "]
[null,null,null,null,null,null,null,null,null,null,null,null,null,null,"000002415","OCCORURO                                                                                            ","04","06","08","04","0406","000002415 - OCCORURO                                                                                            "]
[null,null,null,null,null,null,null,null,null,null,null,null,null,null,"000002416","PALLPATA                                                                                            ","04","06","08","05","0406","000002416 - PALLPATA                                                                                            "]
[null,null,null,null,null,null,null,null,null,null,null,null,null,null,"000002418","SAN MIGUEL                                                                                          ","04","06","08","06","0406","000002418 - SAN MIGUEL                                                                                          "]
[null,null,null,null,null,null,null,null,null,null,null,null,null,null,"000002419","SUYKUTAMBO                                                                                          ","04","06","08","07","0406","000002419 - SUYKUTAMBO                                                                                          "]
[null,null,null,null,null,null,null,null,null,null,null,null,null,null,"000002420","ACCOCUNCA                                                                                           ","04","06","08","08","0406","000002420 - ACCOCUNCA                                                                                           "]
[null,null,null,null,null,null,null,null,null,null,null,null,null,null,"000006745","TINTAYA MARQUIRI                                                                                    ","04","06","08","01","0406","000006745 - TINTAYA MARQUIRI                                                                                    "]
[null,null,null,null,null,null,null,null,null,null,null,null,null,null,"000010061","ESSALUD-ESPINAR","04","06","08","01","0406","000010061 - ESSALUD-ESPINAR"]
[null,null,null,null,null,null,null,null,null,null,null,null,null,null,"000030366","MENTAL COMUNITARIO ESPINAR","04","06","08","01","0406","000030366 - MENTAL COMUNITARIO ESPINAR"]
[null,null,null,null,null,null,null,null,null,null,null,null,null,null,"000034450","PICHIGUA ESPINAR                                                                                    ","04","06","08","06","0406","000034450 - PICHIGUA ESPINAR                                                                                    "]
[null,null,null,null,null,null,null,null,null,null,null,null,null,null,"999999999","(All)","04","99",null,null,{"$f":"CONCATENATE(Q361,R361)","v":"0499"},"999999999 - (All)"]
[null,null,null,null,null,null,null,null,null,null,null,null,null,null,"000002469","SAN JUAN DE KIMBIRI-VRAEM                                                                           ","05","00","09","07","0500","000002469 - SAN JUAN DE KIMBIRI-VRAEM                                                                           "]
[null,null,null,null,null,null,null,null,null,null,null,null,null,null,"000000000","(All)","05","01",null,null,"0501","000000000 - (All)"]
[null,null,null,null,null,null,null,null,null,null,null,null,null,null,"000002470","CHIRUMPIARI                                                                                         ","05","01","09","16","0501","000002470 - CHIRUMPIARI                                                                                         "]
[null,null,null,null,null,null,null,null,null,null,null,null,null,null,"000002471","LOBO TAHUANTINSUYO                                                                                  ","05","01","09","17","0501","000002471 - LOBO TAHUANTINSUYO                                                                                  "]
[null,null,null,null,null,null,null,null,null,null,null,null,null,null,"000002472","MAPITUNARI                                                                                          ","05","01","09","07","0501","000002472 - MAPITUNARI                                                                                          "]
[null,null,null,null,null,null,null,null,null,null,null,null,null,null,"000002473","UNION ROSALES                                                                                       ","05","01","09","17","0501","000002473 - UNION ROSALES                                                                                       "]
[null,null,null,null,null,null,null,null,null,null,null,null,null,null,"000002474","SAMANIATO                                                                                           ","05","01","09","07","0501","000002474 - SAMANIATO                                                                                           "]
[null,null,null,null,null,null,null,null,null,null,null,null,null,null,"000002475","KIMBIRI ALTO                                                                                        ","05","01","09","07","0501","000002475 - KIMBIRI ALTO                                                                                        "]
[null,null,null,null,null,null,null,null,null,null,null,null,null,null,"000002479","VILLA VIRGEN                                                                                        ","05","01","09",12,"0501","000002479 - VILLA VIRGEN                                                                                        "]
[null,null,null,null,null,null,null,null,null,null,null,null,null,null,"000002488","VILLA QUINTIARINA                                                                                   ","05","01","09",13,"0501","000002488 - VILLA QUINTIARINA                                                                                   "]
[null,null,null,null,null,null,null,null,null,null,null,null,null,null,"000008283","PUEBLO LIBRE                                                                                        ","05","01","09","07","0501","000008283 - PUEBLO LIBRE                                                                                        "]
[null,null,null,null,null,null,null,null,null,null,null,null,null,null,"000008284","MANITEA ALTA                                                                                        ","05","01","09","17","0501","000008284 - MANITEA ALTA                                                                                        "]
[null,null,null,null,null,null,null,null,null,null,null,null,null,null,"000008285","ANGELES                                                                                             ","05","01","09","07","0501","000008285 - ANGELES                                                                                             "]
[null,null,null,null,null,null,null,null,null,null,null,null,null,null,"000024957","EJERCITO-LA OROYA 34                                                                                 ","05","01","09",12,"0501","000024957 - EJERCITO-LA OROYA 34                                                                                 "]
[null,null,null,null,null,null,null,null,null,null,null,null,null,null,"000000000","(All)","05","02",null,null,"0502","000000000 - (All)"]
[null,null,null,null,null,null,null,null,null,null,null,null,null,null,"000002495","MANTARO                                                                                             ","05","02","09","18","0502","000002495 - MANTARO                                                                                             "]
[null,null,null,null,null,null,null,null,null,null,null,null,null,null,"000002496","OMAYA                                                                                               ","05","02","09","10","0502","000002496 - OMAYA                                                                                               "]
[null,null,null,null,null,null,null,null,null,null,null,null,null,null,"000002497","OTARI                                                                                               ","05","02","09","10","0502","000002497 - OTARI                                                                                               "]
[null,null,null,null,null,null,null,null,null,null,null,null,null,null,"000002498","PUERTO MAYO                                                                                         ","05","02","09","10","0502","000002498 - PUERTO MAYO                                                                                         "]
[null,null,null,null,null,null,null,null,null,null,null,null,null,null,"000007113","NATIVIDAD                                                                                           ","05","02","09","10","0502","000007113 - NATIVIDAD                                                                                           "]
[null,null,null,null,null,null,null,null,null,null,null,null,null,null,"000007114","QUISTO CENTRAL                                                                                      ","05","02","09","10","0502","000007114 - QUISTO CENTRAL                                                                                      "]
[null,null,null,null,null,null,null,null,null,null,null,null,null,null,"000015104","TAMBO DEL ENE                                                                                       ","05","02","09","10","0502","000015104 - TAMBO DEL ENE                                                                                       "]
[null,null,null,null,null,null,null,null,null,null,null,null,null,null,"000015169","PITIRINQUINI                                                                                        ","05","02","09","10","0502","000015169 - PITIRINQUINI                                                                                        "]
[null,null,null,null,null,null,null,null,null,null,null,null,null,null,"000015170","PICHARI BAJA                                                                                        ","05","02","09","10","0502","000015170 - PICHARI BAJA                                                                                        "]
[null,null,null,null,null,null,null,null,null,null,null,null,null,null,"000024638","EJERCITO-MILITAR PICHARI                                                                    ","05","02","09","10","0502","000024638 - EJERCITO-MILITAR PICHARI                                                                    "]
[null,null,null,null,null,null,null,null,null,null,null,null,null,null,"000027230","SANIDAD-PICHARI PNP                                                                            ","05","02","09","10","0502","000027230 - SANIDAD-PICHARI PNP                                                                            "]
[null,null,null,null,null,null,null,null,null,null,null,null,null,null,"000027948","ESSALUD-PICHARI                                                                       ","05","02","09","10","0502","000027948 - ESSALUD-PICHARI                                                                       "]
[null,null,null,null,null,null,null,null,null,null,null,null,null,null,"000032211","NUEVO PROGRESO                                                          ","05","02","09","10","0502","000032211 - NUEVO PROGRESO                                                          "]
[null,null,null,null,null,null,null,null,null,null,null,null,null,null,"000033988","MENTAL COMUNITARIO PICHARI","05","02","09","10","0502","000033988 - MENTAL COMUNITARIO PICHARI"]
[null,null,null,null,null,null,null,null,null,null,null,null,null,null,"000034418","PICHARI VRAEM                                                                ","05","02","09","10","0502","000034418 - PICHARI VRAEM                                                                "]
[null,null,null,null,null,null,null,null,null,null,null,null,null,null,"999999999","(All)","05","99",null,null,"0599","999999999 - (All)"]
[null,null,null,null,null,null,null,null,null,null,null,null,null,null,"000002398","HOSPITAL SANTO TOMAS","06","00","07","01","0600","000002398 - HOSPITAL SANTO TOMAS"]
[null,null,null,null,null,null,null,null,null,null,null,null,null,null,"000000000","(All)","06","09",null,null,"0609",{"$f":"CONCATENATE(O394,\" - \",P394)","v":"000000000 - (All)"}]
[null,null,null,null,null,null,null,null,null,null,null,null,null,null,"000002399","PULPERA                                                                                             ","06","09","07","01","0609","000002399 - PULPERA                                                                                             "]
[null,null,null,null,null,null,null,null,null,null,null,null,null,null,"000002400","ALHUACCHULLO                                                                                        ","06","09","07","01","0609","000002400 - ALHUACCHULLO                                                                                        "]
[null,null,null,null,null,null,null,null,null,null,null,null,null,null,"000002401","CCAPACMARCA                                                                                         ","06","09","07","02","0609","000002401 - CCAPACMARCA                                                                                         "]
[null,null,null,null,null,null,null,null,null,null,null,null,null,null,"000002404","COLQUEMARCA                                                                                         ","06","09","07","04","0609","000002404 - COLQUEMARCA                                                                                         "]
[null,null,null,null,null,null,null,null,null,null,null,null,null,null,"000002405","CHARAMURAY                                                                                          ","06","09","07","04","0609","000002405 - CHARAMURAY                                                                                          "]
[null,null,null,null,null,null,null,null,null,null,null,null,null,null,"000002407","LLUSCO                                                                                              ","06","09","07","06","0609","000002407 - LLUSCO                                                                                              "]
[null,null,null,null,null,null,null,null,null,null,null,null,null,null,"000002408","QUIÑOTA                                                                                             ","06","09","07","07","0609","000002408 - QUIÑOTA                                                                                             "]
[null,null,null,null,null,null,null,null,null,null,null,null,null,null,"000002409","VELILLE                                                                                             ","06","09","07","08","0609","000002409 - VELILLE                                                                                             "]
[null,null,null,null,null,null,null,null,null,null,null,null,null,null,"000006746","LLIQUE                                                                                              ","06","09","07","01","0609","000006746 - LLIQUE                                                                                              "]
[null,null,null,null,null,null,null,null,null,null,null,null,null,null,"000006747","LUTTO                                                                                               ","06","09","07","06","0609","000006747 - LUTTO                                                                                               "]
[null,null,null,null,null,null,null,null,null,null,null,null,null,null,"000006748","COLLPA                                                                                              ","06","09","07","06","0609","000006748 - COLLPA                                                                                              "]
[null,null,null,null,null,null,null,null,null,null,null,null,null,null,"000006981","CCOYO                                                                                               ","06","09","07","01","0609","000006981 - CCOYO                                                                                               "]
[null,null,null,null,null,null,null,null,null,null,null,null,null,null,"000006982","MELLOTOTORA                                                                                         ","06","09","07","01","0609","000006982 - MELLOTOTORA                                                                                         "]
[null,null,null,null,null,null,null,null,null,null,null,null,null,null,"000006983","ORCCOMA                                                                                             ","06","09","07","01","0609","000006983 - ORCCOMA                                                                                             "]
[null,null,null,null,null,null,null,null,null,null,null,null,null,null,"000006984","CCOLLANA                                                                                            ","06","09","07","07","0609","000006984 - CCOLLANA                                                                                            "]
[null,null,null,null,null,null,null,null,null,null,null,null,null,null,"000006985","TOTORAPALLCA                                                                                        ","06","09","07","06","0609","000006985 - TOTORAPALLCA                                                                                        "]
[null,null,null,null,null,null,null,null,null,null,null,null,null,null,"000007111","YAVINA                                                                                              ","06","09","07","01","0609","000007111 - YAVINA                                                                                              "]
[null,null,null,null,null,null,null,null,null,null,null,null,null,null,"000007112","YORENCCA                                                                                            ","06","09","07","07","0609","000007112 - YORENCCA                                                                                            "]
[null,null,null,null,null,null,null,null,null,null,null,null,null,null,"000008912","ALCCA VICTORIA                                                                                      ","06","09","07","08","0609","000008912 - ALCCA VICTORIA                                                                                      "]
[null,null,null,null,null,null,null,null,null,null,null,null,null,null,"000008913","HUARACO                                                                                             ","06","09","07","04","0609","000008913 - HUARACO                                                                                             "]
[null,null,null,null,null,null,null,null,null,null,null,null,null,null,"000008914","HUAYLLANI                                                                                           ","06","09","07","04","0609","000008914 - HUAYLLANI                                                                                           "]
[null,null,null,null,null,null,null,null,null,null,null,null,null,null,"000008915","PFULLPURI CONDEPAMPA                                                                                ","06","09","07","01","0609","000008915 - PFULLPURI CONDEPAMPA                                                                                "]
[null,null,null,null,null,null,null,null,null,null,null,null,null,null,"000009963","CANCAHUANI                                                                                          ","06","09","07","02","0609","000009963 - CANCAHUANI                                                                                          "]
[null,null,null,null,null,null,null,null,null,null,null,null,null,null,"000012932","YANQUE                                                                                              ","06","09","07","04","0609","000012932 - YANQUE                                                                                              "]
[null,null,null,null,null,null,null,null,null,null,null,null,null,null,"000013185","ESSALUD-SANTO TOMAS","06","09","07","01","0609","000013185 - ESSALUD-SANTO TOMAS"]
[null,null,null,null,null,null,null,null,null,null,null,null,null,null,"000025369","PUMALLACTA","06","09","07","07","0609","000025369 - PUMALLACTA"]
[null,null,null,null,null,null,null,null,null,null,null,null,null,null,"000025371","TUNTUMA","06","09","07","08","0609","000025371 - TUNTUMA"]
[null,null,null,null,null,null,null,null,null,null,null,null,null,null,"000027008","ANTUYO","06","09","07","06","0609","000027008 - ANTUYO"]
[null,null,null,null,null,null,null,null,null,null,null,null,null,null,"000027009","TAHUAY","06","09","07","02","0609","000027009 - TAHUAY"]
[null,null,null,null,null,null,null,null,null,null,null,null,null,null,"000027011","AYACCASI","06","09","07","08","0609","000027011 - AYACCASI"]
[null,null,null,null,null,null,null,null,null,null,null,null,null,null,"000027016","HUAYCUÑUTA - URCURUTA","06","09","07","08",{"$f":"CONCATENATE(Q425,R425)","v":"0609"},"000027016 - HUAYCUÑUTA - URCURUTA"]
[null,null,null,null,null,null,null,null,null,null,null,null,null,null,"000030940","ARCANGEL SAN MIGUEL DE ESQUINA CONGUNYA","06","09","07","01","0609","000030940 - ARCANGEL SAN MIGUEL DE ESQUINA CONGUNYA"]
[null,null,null,null,null,null,null,null,null,null,null,null,null,null,"000000000","(All)","06","01",null,null,"0601","000000000 - (All)"]
[null,null,null,null,null,null,null,null,null,null,null,null,null,null,"000002402","CHAMACA                                                                                             ","06","01","07","03","0601","000002402 - CHAMACA                                                                                             "]
[null,null,null,null,null,null,null,null,null,null,null,null,null,null,"000002403","AÑAHUICHI                                                                                           ","06","01","07","03","0601","000002403 - AÑAHUICHI                                                                                           "]
[null,null,null,null,null,null,null,null,null,null,null,null,null,null,"000002406","LIVITACA                                                                                            ","06","01","07","05","0601","000002406 - LIVITACA                                                                                            "]
[null,null,null,null,null,null,null,null,null,null,null,null,null,null,"000016325","CHILLOROYA - LIVITACA                                                                               ","06","01","07","05","0601","000016325 - CHILLOROYA - LIVITACA                                                                               "]
[null,null,null,null,null,null,null,null,null,null,null,null,null,null,"000016327","AUSANTA                                                                                             ","06","01","07","05","0601","000016327 - AUSANTA                                                                                             "]
[null,null,null,null,null,null,null,null,null,null,null,null,null,null,"000016328","UCCHUCCARCCO                                                                                        ","06","01","07","03","0601","000016328 - UCCHUCCARCCO                                                                                        "]
[null,null,null,null,null,null,null,null,null,null,null,null,null,null,"000016329","INGATA                                                                                              ","06","01","07","03","0601","000016329 - INGATA                                                                                              "]
[null,null,null,null,null,null,null,null,null,null,null,null,null,null,"000016330","CCONCHACCOLLO                                                                                       ","06","01","07","03","0601","000016330 - CCONCHACCOLLO                                                                                       "]
[null,null,null,null,null,null,null,null,null,null,null,null,null,null,"000016332","PATAQUEÑA - LIVITACA","06","01","07","05","0601","000016332 - PATAQUEÑA - LIVITACA"]
[null,null,null,null,null,null,null,null,null,null,null,null,null,null,"000016334","KISIO                                                                                               ","06","01","07","05","0601","000016334 - KISIO                                                                                               "]
[null,null,null,null,null,null,null,null,null,null,null,null,null,null,"000025739","PISQUICOCHA","06","01","07","05","0601","000025739 - PISQUICOCHA"]
[null,null,null,null,null,null,null,null,null,null,null,null,null,null,"000025740","TOTORA - REYNA DE LOS ANGELES","06","01","07","05","0601","000025740 - TOTORA - REYNA DE LOS ANGELES"]
[null,null,null,null,null,null,null,null,null,null,null,null,null,null,"000035860","KAYNO","06","01","07","05","0601","000035860 - KAYNO"]
[null,null,null,null,null,null,null,null,null,null,null,null,null,null,"000035861","CCACHO","06","01","07","03","0601","000035861 - CCACHO"]
[null,null,null,null,null,null,null,null,null,null,null,null,null,null,"000035862","SANTA ISABEL JALCCO","06","01","07","05","0601","000035862 - SANTA ISABEL JALCCO"]
[null,null,null,null,null,null,null,null,null,null,null,null,null,null,"000035863","TINCURCA","06","01","07","03","0601","000035863 - TINCURCA"]
[null,null,null,null,null,null,null,null,null,null,null,null,null,null,"000035864","CANGALLE","06","01","07","01","0601","000035864 - CANGALLE"]
[null,null,null,null,null,null,null,null,null,null,null,null,null,null,"999999999","(All)","06","99",null,null,{"$f":"CONCATENATE(Q445,R445)","v":"0699"},{"$f":"CONCATENATE(O445,\" - \",P445)","v":"999999999 - (All)"}]
[null,null,null,null,null,null,null,null,null,null,null,null,null,null,"999999999","(All)","99","99",null,null,{"$f":"CONCATENATE(Q446,R446)","v":"9999"},{"$f":"CONCATENATE(O446,\" - \",P446)","v":"999999999 - (All)"}]

{"sheet":"TD","index":1,"n_rows":39,"n_cols":219,"rows_kept":39,"cut":false,"hidden":true,"merged":[[1,1,1,3]]}
[]
[null,"Datos",null,null,null,"Tabla",{"$f":"IF(F3=\"(Todas)\",\"CUSCO \",\"\")","v":""}]
[null,"RED","99 - (All)",null,null,{"$f":"TRIM(MID(C3,5,90))","v":"(All)"},{"$f":"IF(F3=\"(All)\",\" \",F3)","v":" "}]
[null,"Micro Red","9999 - (All)",null,null,{"$f":"TRIM(MID(C4,7,90))","v":"(All)"}," "]
[null,"Establecimiento","999999999 - (All)",null,null,{"$f":"TRIM(MID(C5,12,90))","v":"(All)"}," "]
[null,"Provincia","00 - (All)",null,null,{"$f":"TRIM(MID(C6,6,90))","v":"(All)"}," "]
[null,"Distrito","0000 - (All)",null,null,{"$f":"TRIM(MID(C7,8,90))","v":"(All)"}," "]
[null,"UE","7777 - (All)",null,null,{"$f":"TRIM(MID(C8,8,90))","v":"(All)"}," "]
[]
[null,"AÑO",{"$f":"Datos!B10","v":2025}]
[null,"MESES",1,2,3,4,5,0,0,0,0,0,0,0]
[null,"Mes_desc",{"$f":"IF(C11=1,\"ENERO\",\"\")","v":"ENERO"},{"$f":"IF(D11=2,\"FEBRERO\",\"\")","v":"FEBRERO"},{"$f":"IF(E11=3,\"MARZO\",\"\")","v":"MARZO"},{"$f":"IF(F11=4,\"ABRIL\",\"\")","v":"ABRIL"},{"$f":"IF(G11=5,\"MAYO\",\"\")","v":"MAYO"},{"$f":"IF(H11=6,\"JUNIO\",\"\")","v":""},{"$f":"IF(I11=7,\"JULIO\",\"\")","v":""},{"$f":"IF(J11=8,\"AGOSTO\",\"\")","v":""},{"$f":"IF(K11=9,\"SETIEMBRE\",\"\")","v":""},{"$f":"IF(L11=10,\"OCTUBRE\",\"\")","v":""},{"$f":"IF(M11=11,\"NOVIEMBRE\",\"\")","v":""},{"$f":"IF(N11=12,\"DICIEMBRE\",\"\")","v":""},{"$f":"IF(C11=1,C12,IF(D11=2,D12,IF(E11=3,E12,IF(F11=4,F12,IF(G11=5,G12,IF(H11=6,H12,IF(I11=7,I12,IF(J11=8,J12,IF(K11=9,K12,IF(L11=10,L12,IF(M11=11,M12,IF(N11=12,N12,\"\"))))))))))))","v":"ENERO"}]
[]
[null,"ACUMULADO",20,22,24,26,28,null,null,null,null,null,null,null,{"$f":"MIN(C14:N14)","v":20},{"$f":"MAX(C14:N14)","v":28}]
[null,"Mes_desc_Acu",{"$f":"IF(C14=20,\"ENERO\",\"\")","v":"ENERO"},{"$f":"IF(D14=22,\"FEBRERO\",\"\")","v":"FEBRERO"},{"$f":"IF(E14=24,\"MARZO\",\"\")","v":"MARZO"},{"$f":"IF(F14=26,\"ABRIL\",\"\")","v":"ABRIL"},{"$f":"IF(G14=28,\"MAYO\",\"\")","v":"MAYO"},{"$f":"IF(H14=30,\"JUNIO\",\"\")","v":""},{"$f":"IF(I14=32,\"JULIO\",\"\")","v":""},{"$f":"IF(J14=34,\"AGOSTO\",\"\")","v":""},{"$f":"IF(K14=36,\"SETIEMBRE\",\"\")","v":""},{"$f":"IF(L14=38,\"OCTUBRE\",\"\")","v":""},{"$f":"IF(M14=40,\"NOVIEMBRE\",\"\")","v":""},{"$f":"IF(N14=42,\"DICIEMBRE\",\"\")","v":""},{"$f":"IF(O14=C14,C15,IF(O14=D14,D15,IF(O14=E14,E15,IF(O14=F14,F15,IF(O14=G14,G15,IF(O14=H14,H15,IF(O14=I14,I15,IF(O14=J14,J15,IF(O14=K14,K15,IF(O14=L14,L15,IF(O14=M14,M15,IF(O14=N14,N15,\"\"))))))))))))","v":"ENERO"},{"$f":"IF(P14=D14,D15,IF(P14=E14,E15,IF(P14=F14,F15,IF(P14=G14,G15,IF(P14=H14,H15,IF(P14=I14,I15,IF(P14=J14,J15,IF(P14=K14,K15,IF(P14=L14,L15,IF(P14=M14,M15,IF(P14=N14,N15,IF(P14=O14,O15,\"\"))))))))))))","v":"MAYO"}]
[null,null,null,null,null,null,null,null,null,null,null,null,null,null,{"$f":"CONCATENATE(O15,\" - \",P15)","v":"ENERO - MAYO"},{"$f":"IF(O14=P14,O12,O16)","v":"ENERO - MAYO"}]
["Anio","2025"]
["UE","(Todas)"]
["Red","(Todas)"]
["MicroRed","(Todas)"]
["EESS","(Todas)"]
["Provincia","(Todas)"]
["Distrito","(Todas)"]
[]
[null,"Valores"]
["mes","Suma de bas02","Suma de bas05","Suma de bas07","Suma de bas09","Suma de bas11","Suma de bas13","Suma de bas14","Suma de bas16","Suma de bas18","Suma de bas20","Suma de bas21","Suma de bas22","Suma de bas23","Suma de bas24","Suma de bas25","Suma de bas26","Suma de bas27","Suma de bas28","Suma de bas29","Suma de bas30","Suma de bas31","Suma de bas32","Suma de bas33","Suma de bas34","Suma de bas35","Suma de bas36","Suma de bas37","Suma de bas38","Suma de bas39","Suma de bas40","Suma de bas41","Suma de bas42","Suma de bas43","Suma de bas44","Suma de bas45","Suma de bas46","Suma de bas47","Suma de bas48","Suma de bas49","Suma de bas50","Suma de bas51","Suma de bas52","Suma de bas53","Suma de bas54","Suma de bas55","Suma de bas56","Suma de bas57","Suma de bas58","Suma de bas59","Suma de bas60","Suma de bas61","Suma de bas62","Suma de bas63","Suma de bas64","Suma de bas65","Suma de bas66","Suma de bas67","Suma de bas68","Suma de bas69","Suma de bas70","Suma de bas71","Suma de bas72","Suma de bas73","Suma de bas74","Suma de bas75","Suma de bas76","Suma de bas77","Suma de bas78","Suma de bas79","Suma de bas80","Suma de bas81","Suma de bas82","Suma de bas83","Suma de bas84","Suma de bas85","Suma de bas86","Suma de bas87","Suma de bas88","Suma de bas89","Suma de bas90","Suma de bas91","Suma de bas92","Suma de bas93","Suma de bas94","Suma de bas95","Suma de bas96","Suma de bas97","Suma de bas98","Suma de bas99","Suma de bas100","Suma de bas101","Suma de bas102","Suma de bas103","Suma de bas104","Suma de bas105","Suma de bas106","Suma de bas107","Suma de bas108","Suma de bas109","Suma de bas110","Suma de bas111","Suma de bas112","Suma de bas113","Suma de bas114","Suma de bas115","Suma de bas116","Suma de bas117","Suma de bas118","Suma de bas119","Suma de bas120","Suma de bas121","Suma de bas122","Suma de bas123","Suma de bas124","Suma de bas125","Suma de bas126","Suma de bas127","Suma de bas128","Suma de bas129","Suma de bas130","Suma de bas131","Suma de bas132","Suma de bas133","Suma de bas134","Suma de bas135","Suma de bas136","Suma de bas137","Suma de bas138","Suma de bas139","Suma de bas140","Suma de bas141","Suma de bas142","Suma de bas143","Suma de bas144","Suma de bas145","Suma de bas146","Suma de bas147","Suma de bas148","Suma de bas150","Suma de bas149","Suma de bas151","Suma de bas152","Suma de bas153","Suma de bas154","Suma de bas155","Suma de bas156","Suma de bas157","Suma de bas158","Suma de bas159","Suma de bas160","Suma de bas161","Suma de bas162","Suma de bas163","Suma de bas165","Suma de bas164","Suma de bas166","Suma de bas167","Suma de bas168","Suma de bas169","Suma de bas170","Suma de bas171","Suma de bas172","Suma de bas173","Suma de bas174","Suma de bas175","Suma de bas176","Suma de bas177","Suma de bas178","Suma de bas179","Suma de bas180","Suma de bas181","Suma de bas182","Suma de bas183","Suma de bas184","Suma de bas185","Suma de bas186","Suma de bas187","Suma de bas188","Suma de bas189","Suma de bas190","Suma de bas191","Suma de bas192","Suma de bas194","Suma de bas193","Suma de bas195","Suma de bas197","Suma de bas198","Suma de bas196","Suma de bas01","Suma de bas03","Suma de bas04","Suma de bas06","Suma de bas08","Suma de bas10","Suma de bas12","Suma de bas17","Suma de bas15","Suma de bas19","Suma de bas199","Suma de bas200","Suma de bas201","Suma de bas202","Suma de bas203","Suma de bas204","Suma de bas205","Suma de bas206","Suma de bas207","Suma de bas208","Suma de bas209","Suma de bas210","Suma de bas211","Suma de bas212","Suma de bas213","Suma de bas214","Suma de bas215","Suma de bas216","Suma de bas217","Suma de bas218"]
["1",0,48,0,0,0,0,0,0,0,0,0,0,6,38,61,0,0,0,0,0,0,0,0,10,28,0,0,0,0,4,0,0,0,0,0,0,0,0,0,0,0,0,0,0,0,0,3,0,1,0,0,0,0,0,0,0,0,0,0,0,0,0,0,0,0,0,0,0,0,0,0,0,0,0,0,0,0,0,0,0,0,0,0,0,0,0,0,0,0,0,0,0,0,0,0,4,1,3,11,7,0,0,0,0,0,1,2,2,2,1,0,0,0,2,0,0,0,0,0,0,0,0,0,3,0,0,0,0,0,0,0,0,0,0,0,0,0,0,0,0,0,0,0,0,0,0,0,0,0,0,0,0,0,0,0,0,0,0,0,0,0,0,0,0,0,0,0,0,0,0,0,0,0,0,0,0,0,0,0,0,0,0,0,0,0,0,0,0,0,0,27,0,0,0,0,0,0,0,21,10,2,0,0,6,5,12,5,0,48,2,2,0,0,1,2,34,91,17]
["2",0,51,0,0,0,0,0,0,0,0,0,0,7,35,69,0,0,0,0,0,0,0,4,29,46,0,0,0,0,5,0,0,5,0,0,0,0,0,0,0,0,0,0,0,0,0,0,0,6,10,0,0,0,0,0,0,0,0,0,0,0,0,0,0,0,0,0,0,0,0,0,0,0,0,0,0,0,0,0,0,0,0,0,0,0,0,0,0,0,0,0,0,0,0,0,4,0,5,9,12,0,0,0,0,0,0,1,1,8,6,1,0,0,0,1,0,0,0,2,0,0,0,0,3,0,0,0,0,0,0,0,0,0,0,0,0,0,0,0,0,0,0,0,0,0,0,0,0,0,0,0,0,0,0,0,0,0,0,0,0,0,0,0,0,0,0,0,0,0,0,0,0,0,0,0,0,0,0,0,0,0,0,0,0,0,0,0,0,0,2,16,0,0,0,0,0,0,0,27,12,0,0,0,5,6,11,13,0,53,2,3,0,0,1,2,34,78,16]
["3",0,8,0,0,0,0,0,0,0,0,0,0,8,25,21,0,0,0,0,0,0,0,0,7,43,0,0,0,0,0,0,0,7,0,0,0,0,0,0,0,0,0,0,0,0,0,0,0,4,3,0,0,0,0,0,0,0,0,0,0,0,0,0,0,0,0,0,0,0,0,0,0,0,0,0,0,0,0,0,0,0,0,0,0,0,0,0,0,0,0,0,0,0,0,0,6,5,4,16,14,0,0,0,0,0,8,0,2,5,0,0,0,2,1,0,0,0,0,3,0,0,0,0,7,0,0,0,0,0,0,0,0,0,0,0,0,0,0,0,0,0,0,0,0,0,0,0,0,0,0,0,0,0,0,0,0,0,0,0,0,0,0,0,0,0,0,0,0,0,0,0,0,0,0,0,0,0,0,0,0,0,0,0,0,0,0,0,0,0,8,7,0,0,0,0,0,0,0,30,4,1,0,1,5,8,12,12,0,55,4,1,0,0,0,4,32,87,12]
["4",0,33,0,0,0,0,0,0,0,0,0,0,7,44,63,9,0,0,0,0,0,0,0,19,44,0,0,0,0,0,0,0,0,0,0,0,0,0,0,5,0,0,0,0,0,0,0,0,0,4,0,0,0,0,0,0,0,0,0,0,0,0,0,0,0,0,0,0,0,0,0,0,0,0,0,0,0,0,0,0,0,0,0,0,0,0,0,0,0,0,0,0,0,0,0,4,5,2,23,28,0,0,0,0,0,3,0,0,7,1,0,1,1,2,2,1,0,0,1,0,0,0,0,6,0,0,0,0,0,0,0,0,0,0,0,0,0,0,0,0,0,0,0,0,0,0,0,0,0,0,0,0,0,0,0,0,0,0,0,0,0,0,0,0,0,0,0,0,0,0,0,0,0,0,0,0,0,0,0,0,0,0,0,0,0,0,0,0,0,6,18,0,0,0,0,0,0,0,45,13,0,0,1,4,11,8,19,0,52,5,5,0,0,1,6,28,89,19]
["5",1,23,0,0,0,0,0,0,0,0,0,2,0,86,35,0,0,0,0,0,0,0,5,11,69,0,0,0,0,0,0,0,0,0,0,0,0,0,0,23,0,0,0,0,0,0,0,1,3,14,0,0,0,0,0,0,0,0,0,0,0,0,0,0,0,0,0,0,0,0,0,0,0,0,0,0,0,0,0,0,0,0,0,0,0,0,0,0,0,0,0,0,0,0,0,5,1,2,4,9,0,0,0,0,0,0,0,1,8,0,0,0,0,2,0,1,1,1,3,3,0,0,1,6,0,0,0,0,0,0,0,0,0,0,0,0,0,0,0,0,0,0,0,0,0,0,0,0,0,0,0,0,0,0,0,0,0,0,0,0,0,0,0,0,0,0,0,0,0,0,0,0,0,0,0,0,0,0,0,0,0,0,0,0,0,0,0,0,0,0,59,0,0,0,0,0,0,0,24,6,0,1,0,5,5,10,7,0,45,6,4,0,0,0,3,24,84,18]
["6",0,0,0,0,0,0,0,0,0,0,0,0,0,0,0,0,0,0,0,0,0,0,0,0,0,0,0,0,0,0,0,0,0,0,0,0,0,0,0,0,0,0,0,0,0,0,0,0,0,0,0,0,0,0,0,0,0,0,0,0,0,0,0,0,0,0,0,0,0,0,0,0,0,0,0,0,0,0,0,0,0,0,0,0,0,0,0,0,0,0,0,0,0,0,0,0,0,0,0,0,0,0,0,0,0,0,0,0,0,0,0,0,0,0,0,0,0,0,0,0,0,0,0,0,0,0,0,0,0,0,0,0,0,0,0,0,0,0,0,0,0,0,0,0,0,0,0,0,0,0,0,0,0,0,0,0,0,0,0,0,0,0,0,0,0,0,0,0,0,0,0,0,0,0,0,0,0,0,0,0,0,0,0,0,0,0,0,0,0,0,0,0,0,0,0,0,0,0,0,0,0,0,0,0,0,0,0,0,0,0,0,0,0,0,0,0,0,0]
["7",0,0,0,0,0,0,0,0,0,0,0,0,0,0,0,0,0,0,0,0,0,0,0,0,0,0,0,0,0,0,0,0,0,0,0,0,0,0,0,0,0,0,0,0,0,0,0,0,0,0,0,0,0,0,0,0,0,0,0,0,0,0,0,0,0,0,0,0,0,0,0,0,0,0,0,0,0,0,0,0,0,0,0,0,0,0,0,0,0,0,0,0,0,0,0,0,0,0,0,0,0,0,0,0,0,0,0,0,0,0,0,0,0,0,0,0,0,0,0,0,0,0,0,0,0,0,0,0,0,0,0,0,0,0,0,0,0,0,0,0,0,0,0,0,0,0,0,0,0,0,0,0,0,0,0,0,0,0,0,0,0,0,0,0,0,0,0,0,0,0,0,0,0,0,0,0,0,0,0,0,0,0,0,0,0,0,0,0,0,0,0,0,0,0,0,0,0,0,0,0,0,0,0,0,0,0,0,0,0,0,0,0,0,0,0,0,0,0]
["8",0,0,0,0,0,0,0,0,0,0,0,0,0,0,0,0,0,0,0,0,0,0,0,0,0,0,0,0,0,0,0,0,0,0,0,0,0,0,0,0,0,0,0,0,0,0,0,0,0,0,0,0,0,0,0,0,0,0,0,0,0,0,0,0,0,0,0,0,0,0,0,0,0,0,0,0,0,0,0,0,0,0,0,0,0,0,0,0,0,0,0,0,0,0,0,0,0,0,0,0,0,0,0,0,0,0,0,0,0,0,0,0,0,0,0,0,0,0,0,0,0,0,0,0,0,0,0,0,0,0,0,0,0,0,0,0,0,0,0,0,0,0,0,0,0,0,0,0,0,0,0,0,0,0,0,0,0,0,0,0,0,0,0,0,0,0,0,0,0,0,0,0,0,0,0,0,0,0,0,0,0,0,0,0,0,0,0,0,0,0,0,0,0,0,0,0,0,0,0,0,0,0,0,0,0,0,0,0,0,0,0,0,0,0,0,0,0,0]
["9",0,0,0,0,0,0,0,0,0,0,0,0,0,0,0,0,0,0,0,0,0,0,0,0,0,0,0,0,0,0,0,0,0,0,0,0,0,0,0,0,0,0,0,0,0,0,0,0,0,0,0,0,0,0,0,0,0,0,0,0,0,0,0,0,0,0,0,0,0,0,0,0,0,0,0,0,0,0,0,0,0,0,0,0,0,0,0,0,0,0,0,0,0,0,0,0,0,0,0,0,0,0,0,0,0,0,0,0,0,0,0,0,0,0,0,0,0,0,0,0,0,0,0,0,0,0,0,0,0,0,0,0,0,0,0,0,0,0,0,0,0,0,0,0,0,0,0,0,0,0,0,0,0,0,0,0,0,0,0,0,0,0,0,0,0,0,0,0,0,0,0,0,0,0,0,0,0,0,0,0,0,0,0,0,0,0,0,0,0,0,0,0,0,0,0,0,0,0,0,0,0,0,0,0,0,0,0,0,0,0,0,0,0,0,0,0,0,0]
["10",0,0,0,0,0,0,0,0,0,0,0,0,0,0,0,0,0,0,0,0,0,0,0,0,0,0,0,0,0,0,0,0,0,0,0,0,0,0,0,0,0,0,0,0,0,0,0,0,0,0,0,0,0,0,0,0,0,0,0,0,0,0,0,0,0,0,0,0,0,0,0,0,0,0,0,0,0,0,0,0,0,0,0,0,0,0,0,0,0,0,0,0,0,0,0,0,0,0,0,0,0,0,0,0,0,0,0,0,0,0,0,0,0,0,0,0,0,0,0,0,0,0,0,0,0,0,0,0,0,0,0,0,0,0,0,0,0,0,0,0,0,0,0,0,0,0,0,0,0,0,0,0,0,0,0,0,0,0,0,0,0,0,0,0,0,0,0,0,0,0,0,0,0,0,0,0,0,0,0,0,0,0,0,0,0,0,0,0,0,0,0,0,0,0,0,0,0,0,0,0,0,0,0,0,0,0,0,0,0,0,0,0,0,0,0,0,0,0]
["11",0,0,0,0,0,0,0,0,0,0,0,0,0,0,0,0,0,0,0,0,0,0,0,0,0,0,0,0,0,0,0,0,0,0,0,0,0,0,0,0,0,0,0,0,0,0,0,0,0,0,0,0,0,0,0,0,0,0,0,0,0,0,0,0,0,0,0,0,0,0,0,0,0,0,0,0,0,0,0,0,0,0,0,0,0,0,0,0,0,0,0,0,0,0,0,0,0,0,0,0,0,0,0,0,0,0,0,0,0,0,0,0,0,0,0,0,0,0,0,0,0,0,0,0,0,0,0,0,0,0,0,0,0,0,0,0,0,0,0,0,0,0,0,0,0,0,0,0,0,0,0,0,0,0,0,0,0,0,0,0,0,0,0,0,0,0,0,0,0,0,0,0,0,0,0,0,0,0,0,0,0,0,0,0,0,0,0,0,0,0,0,0,0,0,0,0,0,0,0,0,0,0,0,0,0,0,0,0,0,0,0,0,0,0,0,0,0,0]
["12",0,0,0,0,0,0,0,0,0,0,0,0,0,0,0,0,0,0,0,0,0,0,0,0,0,0,0,0,0,0,0,0,0,0,0,0,0,0,0,0,0,0,0,0,0,0,0,0,0,0,0,0,0,0,0,0,0,0,0,0,0,0,0,0,0,0,0,0,0,0,0,0,0,0,0,0,0,0,0,0,0,0,0,0,0,0,0,0,0,0,0,0,0,0,0,0,0,0,0,0,0,0,0,0,0,0,0,0,0,0,0,0,0,0,0,0,0,0,0,0,0,0,0,0,0,0,0,0,0,0,0,0,0,0,0,0,0,0,0,0,0,0,0,0,0,0,0,0,0,0,0,0,0,0,0,0,0,0,0,0,0,0,0,0,0,0,0,0,0,0,0,0,0,0,0,0,0,0,0,0,0,0,0,0,0,0,0,0,0,0,0,0,0,0,0,0,0,0,0,0,0,0,0,0,0,0,0,0,0,0,0,0,0,0,0,0,0,0]
["Total general",1,163,0,0,0,0,0,0,0,0,0,2,28,228,249,9,0,0,0,0,0,0,9,76,230,0,0,0,0,9,0,0,12,0,0,0,0,0,0,28,0,0,0,0,0,0,3,1,14,31,0,0,0,0,0,0,0,0,0,0,0,0,0,0,0,0,0,0,0,0,0,0,0,0,0,0,0,0,0,0,0,0,0,0,0,0,0,0,0,0,0,0,0,0,0,23,12,16,63,70,0,0,0,0,0,12,3,6,30,8,1,1,3,7,3,2,1,1,9,3,0,0,1,25,0,0,0,0,0,0,0,0,0,0,0,0,0,0,0,0,0,0,0,0,0,0,0,0,0,0,0,0,0,0,0,0,0,0,0,0,0,0,0,0,0,0,0,0,0,0,0,0,0,0,0,0,0,0,0,0,0,0,0,0,0,0,0,0,0,16,127,0,0,0,0,0,0,0,147,45,3,1,2,25,35,53,56,0,253,19,15,0,0,3,17,152,429,82]

{"sheet":"Menu","index":2,"n_rows":31,"n_cols":9,"rows_kept":31,"cut":false,"hidden":false,"merged":[[30,5,30,7],[1,7,1,16],[2,7,2,16],[3,7,3,16]]}
[]
[null,null,null,null,null,null,null,"GERESA CUSCO"]
[null,null,null,null,null,null,null,"REPORTE HISMINSA 2025"]
[null,null,null,null,null,null,null,"DISCAPACIDAD"]
[]
[]
[]
[]
[]
[]
[]
[]
[]
[]
[]
[]
[]
[]
[]
[]
[]
[]
[]
[]
[]
[]
[]
[]
[]
[]
[null,null,null,null,null,"Fecha Actulización DATA",null,null,"31/05/2025"]

{"sheet":"Discapacidad","index":3,"n_rows":68,"n_cols":20,"rows_kept":68,"cut":false,"hidden":false,"merged":[[49,1,49,5],[19,1,19,5],[0,1,0,21],[1,1,1,21],[2,1,2,21],[3,1,3,21],[4,1,4,21],[6,3,6,7],[6,11,6,16],[6,19,6,21],[10,11,10,16],[8,3,8,7],[8,11,8,16],[8,19,8,21],[10,3,10,7],[18,1,18,5],[33,1,33,5],[20,1,20,5],[21,1,21,5],[22,1,22,5],[23,1,23,5],[24,1,24,5],[25,1,25,5],[26,1,26,5],[27,1,27,5],[28,1,28,5],[29,1,29,5],[30,1,30,5],[54,1,54,5],[34,1,34,5],[35,1,35,5],[36,1,36,5],[37,1,37,5],[38,1,38,5],[39,1,39,5],[40,1,40,5],[41,1,41,5],[42,1,42,5],[52,1,52,5],[53,1,53,5],[45,1,45,5],[46,1,46,5],[47,1,47,5],[48,1,48,5],[65,8,65,9],[58,1,58,3],[59,1,59,3],[60,1,60,3],[61,1,61,3],[62,1,62,3],[65,6,65,7]]}
[null,"DIRECCION REGIONAL DE SALUD CUSCO"]
[null,"DIRECCION EJECUTIVA DE INTELIGENCIA SANITARIA"]
[null,"DIRECCION DE ESTADISTICA Y TELECOMUNICACIONES"]
[null,"DISCAPACIDAD"]
[null,"INFORME OPERACIONAL MENSUAL"]
[]
[null,"RED DE SALUD",null,{"$f":"TD!F3","v":"(All)"},null,null,null,null,null,"PROVINCIA",null,{"$f":"TD!F6","v":"(All)"},null,null,null,null,null,null,"AÑO :",{"$f":"TD!C10","v":2025}]
[]
[null,"MICRO RED",null,{"$f":"TD!F4","v":"(All)"},null,null,null,null,null,"DISTRITO",null,{"$f":"TD!F7","v":"(All)"},null,null,null,null,null,null,"MES :",{"$f":"TD!P16","v":"ENERO - MAYO"}]
[]
[null,"ESTABLECIMIENTO",null,{"$f":"TD!F5","v":"(All)"},null,null,null,null,null,"UE",null,{"$f":"TD!F8","v":"(All)"}]
[]
[null,"PERSONAS CON DISCAPACIDAD RECIBEN ATENCION DE REHABILITACION EN ESTABLECIMIENTOS DE SALUD (3000688)"]
[]
[null,null,null,"Nº","Capacitados"]
[null,null,"Capacitación  ",{"$f":"GETPIVOTDATA(\"Suma de bas136\",TD!$A$25)","v":0},{"$f":"GETPIVOTDATA(\"Suma de bas137\",TD!$A$25)","v":0}]
[]
[null,"Atención de Rehabilitación en Personas con Discapacidad de Tipo Física (5005150) "]
[null,"Atenciones",null,null,null,null,"Total","Niños\n(1d - 11a)","Adolescentes\n(12a - 17a)","Jóvenes\n(18a - 29a)","Adultos\n(30a - 59a)","A. Mayores\n(60a +)"]
[null,"Lesiones medulares (0515001)",null,null,null,null,{"$f":"SUM(H20:L20)","v":307},{"$f":"GETPIVOTDATA(\"Suma de bas01\",TD!$A$25)","v":0},{"$f":"GETPIVOTDATA(\"Suma de bas02\",TD!$A$25)","v":1},{"$f":"GETPIVOTDATA(\"Suma de bas03\",TD!$A$25)","v":16},{"$f":"GETPIVOTDATA(\"Suma de bas04\",TD!$A$25)","v":127},{"$f":"GETPIVOTDATA(\"Suma de bas05\",TD!$A$25)","v":163}]
[null,"Amputados de miembro superior (0515002)",null,null,null,null,{"$f":"SUM(H21:L21)","v":0},{"$f":"GETPIVOTDATA(\"Suma de bas06\",TD!$A$25)","v":0},{"$f":"GETPIVOTDATA(\"Suma de bas07\",TD!$A$25)","v":0},{"$f":"GETPIVOTDATA(\"Suma de bas08\",TD!$A$25)","v":0},{"$f":"GETPIVOTDATA(\"Suma de bas09\",TD!$A$25)","v":0},{"$f":"GETPIVOTDATA(\"Suma de bas10\",TD!$A$25)","v":0}]
[null,"Amputados de miembro inferior (0515003)",null,null,null,null,0,{"$f":"GETPIVOTDATA(\"Suma de bas11\",TD!$A$25)","v":0},{"$f":"GETPIVOTDATA(\"Suma de bas12\",TD!$A$25)","v":0},{"$f":"GETPIVOTDATA(\"Suma de bas13\",TD!$A$25)","v":0},{"$f":"GETPIVOTDATA(\"Suma de bas14\",TD!$A$25)","v":0},{"$f":"GETPIVOTDATA(\"Suma de bas15\",TD!$A$25)","v":0}]
[null,"Enfermedad muscular y unión mioneural (0515004)",null,null,null,null,0,{"$f":"GETPIVOTDATA(\"Suma de bas16\",TD!$A$25)","v":0},{"$f":"GETPIVOTDATA(\"Suma de bas17\",TD!$A$25)","v":0},{"$f":"GETPIVOTDATA(\"Suma de bas18\",TD!$A$25)","v":0},{"$f":"GETPIVOTDATA(\"Suma de bas19\",TD!$A$25)","v":0},{"$f":"GETPIVOTDATA(\"Suma de bas20\",TD!$A$25)","v":0}]
[null,"Lesiones de nervio periférico (0515005)",null,null,null,null,507,{"$f":"GETPIVOTDATA(\"Suma de bas21\",TD!$A$25)","v":0},{"$f":"GETPIVOTDATA(\"Suma de bas22\",TD!$A$25)","v":2},{"$f":"GETPIVOTDATA(\"Suma de bas23\",TD!$A$25)","v":28},{"$f":"GETPIVOTDATA(\"Suma de bas24\",TD!$A$25)","v":228},{"$f":"GETPIVOTDATA(\"Suma de bas25\",TD!$A$25)","v":249}]
[null,"Trastornos del desarrollo de la función motriz (0515006)",null,null,null,null,9,{"$f":"GETPIVOTDATA(\"Suma de bas26\",TD!$A$25)","v":9},{"$f":"GETPIVOTDATA(\"Suma de bas27\",TD!$A$25)","v":0},{"$f":"GETPIVOTDATA(\"Suma de bas28\",TD!$A$25)","v":0},{"$f":"GETPIVOTDATA(\"Suma de bas29\",TD!$A$25)","v":0},{"$f":"GETPIVOTDATA(\"Suma de bas30\",TD!$A$25)","v":0}]
[null,"Enfermedad articular degenerativa (0515007)",null,null,null,null,315,{"$f":"GETPIVOTDATA(\"Suma de bas31\",TD!$A$25)","v":0},{"$f":"GETPIVOTDATA(\"Suma de bas32\",TD!$A$25)","v":0},{"$f":"GETPIVOTDATA(\"Suma de bas33\",TD!$A$25)","v":9},{"$f":"GETPIVOTDATA(\"Suma de bas34\",TD!$A$25)","v":76},{"$f":"GETPIVOTDATA(\"Suma de bas35\",TD!$A$25)","v":230}]
[null,"Enfermedad cerebro vascular (0515008)",null,null,null,null,9,{"$f":"GETPIVOTDATA(\"Suma de bas36\",TD!$A$25)","v":0},{"$f":"GETPIVOTDATA(\"Suma de bas37\",TD!$A$25)","v":0},{"$f":"GETPIVOTDATA(\"Suma de bas38\",TD!$A$25)","v":0},{"$f":"GETPIVOTDATA(\"Suma de bas39\",TD!$A$25)","v":0},{"$f":"GETPIVOTDATA(\"Suma de bas40\",TD!$A$25)","v":9}]
[null,"Encefalopatía infantil (0515009)",null,null,null,null,12,{"$f":"GETPIVOTDATA(\"Suma de bas41\",TD!$A$25)","v":0},{"$f":"GETPIVOTDATA(\"Suma de bas42\",TD!$A$25)","v":0},{"$f":"GETPIVOTDATA(\"Suma de bas43\",TD!$A$25)","v":12},{"$f":"GETPIVOTDATA(\"Suma de bas44\",TD!$A$25)","v":0},{"$f":"GETPIVOTDATA(\"Suma de bas45\",TD!$A$25)","v":0}]
[null,"Enfermedad de Parkinson (0515010)",null,null,null,null,28,{"$f":"GETPIVOTDATA(\"Suma de bas46\",TD!$A$25)","v":0},{"$f":"GETPIVOTDATA(\"Suma de bas47\",TD!$A$25)","v":0},{"$f":"GETPIVOTDATA(\"Suma de bas48\",TD!$A$25)","v":0},{"$f":"GETPIVOTDATA(\"Suma de bas49\",TD!$A$25)","v":0},{"$f":"GETPIVOTDATA(\"Suma de bas50\",TD!$A$25)","v":28}]
[null,"Síndrome de Down (0515011)",null,null,null,null,0,{"$f":"GETPIVOTDATA(\"Suma de bas51\",TD!$A$25)","v":0},{"$f":"GETPIVOTDATA(\"Suma de bas52\",TD!$A$25)","v":0},{"$f":"GETPIVOTDATA(\"Suma de bas53\",TD!$A$25)","v":0},{"$f":"GETPIVOTDATA(\"Suma de bas54\",TD!$A$25)","v":0},{"$f":"GETPIVOTDATA(\"Suma de bas55\",TD!$A$25)","v":0}]
[null,"Trastornos posturales (0515012)",null,null,null,null,49,{"$f":"GETPIVOTDATA(\"Suma de bas56\",TD!$A$25)","v":0},{"$f":"GETPIVOTDATA(\"Suma de bas57\",TD!$A$25)","v":3},{"$f":"GETPIVOTDATA(\"Suma de bas58\",TD!$A$25)","v":1},{"$f":"GETPIVOTDATA(\"Suma de bas59\",TD!$A$25)","v":14},{"$f":"GETPIVOTDATA(\"Suma de bas60\",TD!$A$25)","v":31}]
[]
[null,"Atención de Rehabilitación en Personas con Discapacidad de Tipo Sensorial (5005151)"]
[null,"Atenciones",null,null,null,null,"Total","Niños\n(1d - 11a)","Adolescentes\n(12a - 17a)","Jóvenes\n(18a - 29a)","Adultos\n(30a - 59a)","A. Mayores\n(60a +)"]
[null,"Hipoacusia y/o sordera (0515101)",null,null,null,null,{"$f":"SUM(H35:L35)","v":0},{"$f":"GETPIVOTDATA(\"Suma de bas61\",TD!$A$25)","v":0},{"$f":"GETPIVOTDATA(\"Suma de bas62\",TD!$A$25)","v":0},{"$f":"GETPIVOTDATA(\"Suma de bas63\",TD!$A$25)","v":0},{"$f":"GETPIVOTDATA(\"Suma de bas64\",TD!$A$25)","v":0},{"$f":"GETPIVOTDATA(\"Suma de bas65\",TD!$A$25)","v":0}]
[null,"Baja visión y/o ceguera (0515102)",null,null,null,null,0,{"$f":"GETPIVOTDATA(\"Suma de bas66\",TD!$A$25)","v":0},{"$f":"GETPIVOTDATA(\"Suma de bas67\",TD!$A$25)","v":0},{"$f":"GETPIVOTDATA(\"Suma de bas68\",TD!$A$25)","v":0},{"$f":"GETPIVOTDATA(\"Suma de bas69\",TD!$A$25)","v":0},{"$f":"GETPIVOTDATA(\"Suma de bas70\",TD!$A$25)","v":0}]
[null,"Sordomudez (0515103)",null,null,null,null,0,{"$f":"GETPIVOTDATA(\"Suma de bas71\",TD!$A$25)","v":0},{"$f":"GETPIVOTDATA(\"Suma de bas72\",TD!$A$25)","v":0},{"$f":"GETPIVOTDATA(\"Suma de bas73\",TD!$A$25)","v":0},{"$f":"GETPIVOTDATA(\"Suma de bas74\",TD!$A$25)","v":0},{"$f":"GETPIVOTDATA(\"Suma de bas75\",TD!$A$25)","v":0}]
[null,"Parálisis cerebral infantil (0515104)",null,null,null,null,0,{"$f":"GETPIVOTDATA(\"Suma de bas76\",TD!$A$25)","v":0},{"$f":"GETPIVOTDATA(\"Suma de bas77\",TD!$A$25)","v":0},{"$f":"GETPIVOTDATA(\"Suma de bas78\",TD!$A$25)","v":0},{"$f":"GETPIVOTDATA(\"Suma de bas79\",TD!$A$25)","v":0},{"$f":"GETPIVOTDATA(\"Suma de bas80\",TD!$A$25)","v":0}]
[null,"Enfermedades cerebro vasculares (0515105)",null,null,null,null,0,{"$f":"GETPIVOTDATA(\"Suma de bas81\",TD!$A$25)","v":0},{"$f":"GETPIVOTDATA(\"Suma de bas82\",TD!$A$25)","v":0},{"$f":"GETPIVOTDATA(\"Suma de bas83\",TD!$A$25)","v":0},{"$f":"GETPIVOTDATA(\"Suma de bas84\",TD!$A$25)","v":0},{"$f":"GETPIVOTDATA(\"Suma de bas85\",TD!$A$25)","v":0}]
[null,"Trastornos de aprendizaje (0515201)",null,null,null,null,0,{"$f":"GETPIVOTDATA(\"Suma de bas86\",TD!$A$25)","v":0},{"$f":"GETPIVOTDATA(\"Suma de bas87\",TD!$A$25)","v":0},{"$f":"GETPIVOTDATA(\"Suma de bas88\",TD!$A$25)","v":0},{"$f":"GETPIVOTDATA(\"Suma de bas89\",TD!$A$25)","v":0},{"$f":"GETPIVOTDATA(\"Suma de bas90\",TD!$A$25)","v":0}]
[null,"Retraso mental: leve, moderado, severo (0515202)",null,null,null,null,0,{"$f":"GETPIVOTDATA(\"Suma de bas91\",TD!$A$25)","v":0},{"$f":"GETPIVOTDATA(\"Suma de bas92\",TD!$A$25)","v":0},{"$f":"GETPIVOTDATA(\"Suma de bas93\",TD!$A$25)","v":0},{"$f":"GETPIVOTDATA(\"Suma de bas94\",TD!$A$25)","v":0},{"$f":"GETPIVOTDATA(\"Suma de bas95\",TD!$A$25)","v":0}]
[null,"Trastornos del espectro autista (0515203)",null,null,null,null,0,{"$f":"GETPIVOTDATA(\"Suma de bas96\",TD!$A$25)","v":0},{"$f":"GETPIVOTDATA(\"Suma de bas97\",TD!$A$25)","v":0},{"$f":"GETPIVOTDATA(\"Suma de bas98\",TD!$A$25)","v":0},{"$f":"GETPIVOTDATA(\"Suma de bas99\",TD!$A$25)","v":0},{"$f":"GETPIVOTDATA(\"Suma de bas100\",TD!$A$25)","v":0}]
[null,"Otros trastornos de salud mental (0515204)",null,null,null,null,0,{"$f":"GETPIVOTDATA(\"Suma de bas101\",TD!$A$25)","v":0},{"$f":"GETPIVOTDATA(\"Suma de bas102\",TD!$A$25)","v":0},{"$f":"GETPIVOTDATA(\"Suma de bas103\",TD!$A$25)","v":0},{"$f":"GETPIVOTDATA(\"Suma de bas104\",TD!$A$25)","v":0},{"$f":"GETPIVOTDATA(\"Suma de bas105\",TD!$A$25)","v":0}]
[]
[null,"Atención de Rehabilitación en Personas con Discapacidad de Tipo Mental ()"]
[null,"Atenciones",null,null,null,null,"Total","Niños\n(1d - 11a)","Adolescentes\n(12a - 17a)","Jóvenes\n(18a - 29a)","Adultos\n(30a - 59a)","A. Mayores\n(60a +)"]
[null,"Transtornos de Aprendizaje ()",null,null,null,null,{"$f":"SUM(H47:K47)","v":196},{"$f":"GETPIVOTDATA(\"Suma de bas199\",TD!$A$25)","v":147},{"$f":"GETPIVOTDATA(\"Suma de bas200\",TD!$A$25)","v":45},{"$f":"GETPIVOTDATA(\"Suma de bas201\",TD!$A$25)","v":3},{"$f":"GETPIVOTDATA(\"Suma de bas202\",TD!$A$25)","v":1},{"$f":"GETPIVOTDATA(\"Suma de bas203\",TD!$A$25)","v":2}]
[null,"Retraso Mental:LEVE MODERADO SEVERO ()",null,null,null,null,{"$f":"SUM(H48:K48)","v":169},{"$f":"GETPIVOTDATA(\"Suma de bas204\",TD!$A$25)","v":25},{"$f":"GETPIVOTDATA(\"Suma de bas205\",TD!$A$25)","v":35},{"$f":"GETPIVOTDATA(\"Suma de bas206\",TD!$A$25)","v":53},{"$f":"GETPIVOTDATA(\"Suma de bas207\",TD!$A$25)","v":56},{"$f":"GETPIVOTDATA(\"Suma de bas208\",TD!$A$25)","v":0}]
[null,"Trastornos del Espectro Autista ()",null,null,null,null,{"$f":"SUM(H49:L49)","v":287},{"$f":"GETPIVOTDATA(\"Suma de bas209\",TD!$A$25)","v":253},{"$f":"GETPIVOTDATA(\"Suma de bas210\",TD!$A$25)","v":19},{"$f":"GETPIVOTDATA(\"Suma de bas211\",TD!$A$25)","v":15},{"$f":"GETPIVOTDATA(\"Suma de bas212\",TD!$A$25)","v":0},{"$f":"GETPIVOTDATA(\"Suma de bas213\",TD!$A$25)","v":0}]
[null,"Otros Transtornos de Salud Mental ()",null,null,null,null,{"$f":"SUM(H50:L50)","v":683},{"$f":"GETPIVOTDATA(\"Suma de bas214\",TD!$A$25)","v":3},{"$f":"GETPIVOTDATA(\"Suma de bas215\",TD!$A$25)","v":17},{"$f":"GETPIVOTDATA(\"Suma de bas216\",TD!$A$25)","v":152},{"$f":"GETPIVOTDATA(\"Suma de bas217\",TD!$A$25)","v":429},{"$f":"GETPIVOTDATA(\"Suma de bas218\",TD!$A$25)","v":82}]
[]
[null,"PERSONAS CON DISCAPACIDAD CERTIFICADAS EN ESTABLECIMIENTOS DE SALUD (3000689)"]
[null,"Atenciones",null,null,null,null,"Total","Niños\n(1d - 11a)","Adolescentes\n(12a - 17a)","Jóvenes\n(18a - 29a)","Adultos\n(30a - 59a)","A. Mayores\n(60a +)"]
[null,"Certificación de Discapacidad (0515204)",null,null,null,null,{"$f":"SUM(H54:L54)","v":184},{"$f":"GETPIVOTDATA(\"Suma de bas106\",TD!$A$25)","v":23},{"$f":"GETPIVOTDATA(\"Suma de bas107\",TD!$A$25)","v":12},{"$f":"GETPIVOTDATA(\"Suma de bas108\",TD!$A$25)","v":16},{"$f":"GETPIVOTDATA(\"Suma de bas109\",TD!$A$25)","v":63},{"$f":"GETPIVOTDATA(\"Suma de bas110\",TD!$A$25)","v":70}]
[null,"Certificación de Incapacidad (0515205)",null,null,null,null,0,{"$f":"GETPIVOTDATA(\"Suma de bas111\",TD!$A$25)","v":0},{"$f":"GETPIVOTDATA(\"Suma de bas112\",TD!$A$25)","v":0},{"$f":"GETPIVOTDATA(\"Suma de bas113\",TD!$A$25)","v":0},{"$f":"GETPIVOTDATA(\"Suma de bas114\",TD!$A$25)","v":0},{"$f":"GETPIVOTDATA(\"Suma de bas115\",TD!$A$25)","v":0}]
[]
[]
[null,"PERSONAS CON DISCAPACIDAD RECIBEN SERVICIOS DE REHABILITACIÓN BASADA EN LA COMUNIDAD (3000690) "]
[null,"Visitas",null,null,"Total","Niños\n(1d - 11a)","Adolescentes\n(12a - 17a)","Jóvenes\n(18a - 29a)","Adultos\n(30a - 59a)","A. Mayores\n(60a +)"]
[null,"1º Visita",null,null,{"$f":"SUM(F60:J60)","v":59},{"$f":"GETPIVOTDATA(\"Suma de bas116\",TD!$A$25)","v":12},{"$f":"GETPIVOTDATA(\"Suma de bas117\",TD!$A$25)","v":3},{"$f":"GETPIVOTDATA(\"Suma de bas118\",TD!$A$25)","v":6},{"$f":"GETPIVOTDATA(\"Suma de bas119\",TD!$A$25)","v":30},{"$f":"GETPIVOTDATA(\"Suma de bas120\",TD!$A$25)","v":8}]
[null,"2º Visita",null,null,15,{"$f":"GETPIVOTDATA(\"Suma de bas121\",TD!$A$25)","v":1},{"$f":"GETPIVOTDATA(\"Suma de bas122\",TD!$A$25)","v":1},{"$f":"GETPIVOTDATA(\"Suma de bas123\",TD!$A$25)","v":3},{"$f":"GETPIVOTDATA(\"Suma de bas124\",TD!$A$25)","v":7},{"$f":"GETPIVOTDATA(\"Suma de bas125\",TD!$A$25)","v":3}]
[null,"3º Visita",null,null,16,{"$f":"GETPIVOTDATA(\"Suma de bas126\",TD!$A$25)","v":2},{"$f":"GETPIVOTDATA(\"Suma de bas127\",TD!$A$25)","v":1},{"$f":"GETPIVOTDATA(\"Suma de bas128\",TD!$A$25)","v":1},{"$f":"GETPIVOTDATA(\"Suma de bas129\",TD!$A$25)","v":9},{"$f":"GETPIVOTDATA(\"Suma de bas130\",TD!$A$25)","v":3}]
[null,"4º a + Visitas",null,null,26,{"$f":"GETPIVOTDATA(\"Suma de bas131\",TD!$A$25)","v":0},{"$f":"GETPIVOTDATA(\"Suma de bas132\",TD!$A$25)","v":0},{"$f":"GETPIVOTDATA(\"Suma de bas133\",TD!$A$25)","v":1},{"$f":"GETPIVOTDATA(\"Suma de bas134\",TD!$A$25)","v":25},{"$f":"GETPIVOTDATA(\"Suma de bas135\",TD!$A$25)","v":0}]
[]
[null,"Capacitación a agentes comunitarios en rehabilitación basada en la comunidad (5005155)"]
[null,null,null,null,null,null,"1º TALLER",null,"2º TALLER"]
[null,null,null,null,null,null,"Nº","Capacitados","Nº","Capacitados"]
[null,"Capacitación a Agentes Comunitarios ",null,null,null,null,{"$f":"GETPIVOTDATA(\"Suma de bas138\",TD!$A$25)","v":0},{"$f":"GETPIVOTDATA(\"Suma de bas139\",TD!$A$25)","v":0},{"$f":"GETPIVOTDATA(\"Suma de bas140\",TD!$A$25)","v":0},{"$f":"GETPIVOTDATA(\"Suma de bas141\",TD!$A$25)","v":0}]

{"sheet":"Preventivo","index":4,"n_rows":75,"n_cols":22,"rows_kept":75,"cut":false,"hidden":false,"merged":[[6,4,6,9],[6,13,6,18],[6,21,6,23],[10,13,10,18],[0,0,0,28],[1,0,1,28],[2,0,2,28],[3,0,3,28],[4,0,4,28],[8,4,8,9],[8,13,8,18],[8,21,8,23],[10,4,10,9],[14,0,65,0],[18,3,19,14],[25,4,25,5],[25,6,25,7],[51,8,51,9],[70,13,70,14],[51,10,51,11],[55,7,55,8],[55,9,55,10],[55,11,55,12],[55,13,55,14],[59,7,59,8],[59,9,59,10],[59,11,59,12],[59,13,59,14],[70,3,70,4],[70,5,70,6],[70,7,70,8],[70,9,70,10],[70,11,70,12]]}
["DIRECCION REGIONAL DE SALUD CUSCO"]
["DIRECCION EJECUTIVA DE INTELIGENCIA SANITARIA"]
["DIRECCION DE ESTADISTICA Y TELECOMUNICACIONES"]
["DISCAPACIDAD"]
["INFORME OPERACIONAL MENSUAL"]
[]
[null,"RED DE SALUD",null,null,{"$f":"TD!F3","v":"(All)"},null,null,null,null,null,null,"PROVINCIA",null,{"$f":"TD!F6","v":"(All)"},null,null,null,null,null,null,"AÑO :",{"$f":"TD!C10","v":2025}]
[]
[null,"MICRO RED",null,null,{"$f":"TD!F4","v":"(All)"},null,null,null,null,null,null,"DISTRITO",null,{"$f":"TD!F7","v":"(All)"},null,null,null,null,null,null,"MES :",{"$f":"TD!P16","v":"ENERO - MAYO"}]
[]
[null,"ESTABLECIMIENTO",null,null,{"$f":"TD!F5","v":"(All)"},null,null,null,null,null,null,"UE",null,{"$f":"TD!F8","v":"(All)"}]
[]
["Componente Discapacidad y Otras Actividades de Promoción de la Salud"]
[]
["COMPONENTE DISCAPACIDAD","COMPONENTE PREVENCION Y MANEJO DE CONDICIONES SECUNDARIAS DE SALUD EN PERSONAS CON DISCAPACIDAD"]
[null,"PERSONAS CON DISCAPACIDAD RECIBEN SERVICIOS DE PROMOCION DE LA SALUD (3000687)"]
[]
[null,"1.","CAPACITACIÓN EN ACTIVIDADES DE PROMOCIÓN DE LA SALUD ORIENTADAS A LAS PERSONAS CON DISCAPACIDAD (5005146)"]
[null,null,"1.1.","Consejería en promoción de la salud al año de 45 minutos de duración, realizado en el establecimiento de salud para las personas con discapacidad acompañados por sus familiares y/o cuidadores, en los siguientes temas:"]
[]
[null,null,null,null,"Nº"]
[null,"0101",null,"Consejería",{"$f":"GETPIVOTDATA(\"Suma de bas142\",TD!$A$25)","v":0}]
[]
[null,"2.","CAPACITACIÓN A ESTABLECIMIENTOS DE SALUD PARA LA PROMOCIÓN DE LA SALUD DE LAS PERSONAS CON DISCAPACIDAD (5005147)"]
[null,null,"2.1.","Taller de Capacitación al Personal de Salud de los Establecimientos de Salud "]
[null,null,null,null,"1º TALLER",null,"2º TALLER"]
[null,"0102",null,null,"Nº","Participantes","Nº","Participantes"]
[null,null,null,"Taller",{"$f":"GETPIVOTDATA(\"Suma de bas142\",TD!$A$25)","v":0},{"$f":"GETPIVOTDATA(\"Suma de bas143\",TD!$A$25)","v":0},{"$f":"GETPIVOTDATA(\"Suma de bas144\",TD!$A$25)","v":0},{"$f":"GETPIVOTDATA(\"Suma de bas145\",TD!$A$25)","v":0}]
[]
[null,"3.","CAPACITACIÓN A LOS MUNICIPIOS PARA LA PROMOCIÓN DE LA SALUD DE LAS PERSONAS CON DISCAPACIDAD (5005148)"]
[null,null,"2.1.","Concejo Municipal "]
[null,null,null,null,null,null,null,null,null,null,"Nº","Participantes"]
[null,"0103",null,"Reunión de Coordinación con el Consejo Municipal",null,null,null,null,null,null,{"$f":"GETPIVOTDATA(\"Suma de bas146\",TD!$A$25)","v":0},{"$f":"GETPIVOTDATA(\"Suma de bas147\",TD!$A$25)","v":0}]
[null,null,null,"Reunión de Abogacía con el Concejo Municipal Provincial y Distrital",null,null,null,null,null,null,{"$f":"GETPIVOTDATA(\"Suma de bas148\",TD!$A$25)","v":0},{"$f":"GETPIVOTDATA(\"Suma de bas149\",TD!$A$25)","v":0}]
[null,null,null,"Reunión Técnica con el Concejo Municipal para la conformación o reactivación del Comité Multisectorial",null,null,null,null,null,null,{"$f":"GETPIVOTDATA(\"Suma de bas150\",TD!$A$25)","v":0},{"$f":"GETPIVOTDATA(\"Suma de bas151\",TD!$A$25)","v":0}]
[]
[null,null,"2.2.","Comité Multisectorial",null,null,null,null,"Nº","Participantes"]
[null,"0104",null,"Reunión de Abogacía con el Comité Multisectorial",null,null,null,null,{"$f":"GETPIVOTDATA(\"Suma de bas152\",TD!$A$25)","v":0},{"$f":"GETPIVOTDATA(\"Suma de bas153\",TD!$A$25)","v":0}]
[null,null,null,null,null,null,null,null,"Talleres","Participantes"]
[null,null,null,"Taller de Planificación Participativa con el Comité Multisectorial",null,null,null,null,{"$f":"GETPIVOTDATA(\"Suma de bas154\",TD!$A$25)","v":0},{"$f":"GETPIVOTDATA(\"Suma de bas155\",TD!$A$25)","v":0}]
[null,null,null,"Taller de Capacitación en Generación de Entornos Saludables",null,null,null,null,{"$f":"GETPIVOTDATA(\"Suma de bas156\",TD!$A$25)","v":0},{"$f":"GETPIVOTDATA(\"Suma de bas157\",TD!$A$25)","v":0}]
[]
[null,null,null,null,null,null,"1º Reunión","2º Reunión"]
[null,"0105",null,"Reuniones de Monitoreo y Seguimiento",null,null,{"$f":"GETPIVOTDATA(\"Suma de bas158\",TD!$A$25)","v":0},{"$f":"GETPIVOTDATA(\"Suma de bas159\",TD!$A$25)","v":0}]
[]
[null,null,null,null,null,null,"Nº","Participantes"]
[null,"0106",null,"Reunión de Evaluación",null,null,{"$f":"GETPIVOTDATA(\"Suma de bas160\",TD!$A$25)","v":0},{"$f":"GETPIVOTDATA(\"Suma de bas161\",TD!$A$25)","v":0}]
[]
[null,"4.","CAPACITACIÓN A LAS INSTITUCIONES EDUCATIVAS PARA LA PROMOCIÓN DE LA SALUD DE LAS PERSONAS CON DISCAPACIDAD (5005149)"]
[null,null,null,null,null,null,"Nº","Participantes"]
[null,"0107",null,"Reunión de concertación con directivos",null,null,{"$f":"GETPIVOTDATA(\"Suma de bas162\",TD!$A$25)","v":0},{"$f":"GETPIVOTDATA(\"Suma de bas163\",TD!$A$25)","v":0}]
[null,null,null,null,null,null,null,null,"1º TALLER",null,"2º TALLER"]
[null,null,null,null,null,null,null,null,"Nº","Participantes","Nº","Participantes"]
[null,"0108",null,"Taller de Capacitación al Personal Docente de las Instituciones Educativas",null,null,null,null,{"$f":"GETPIVOTDATA(\"Suma de bas164\",TD!$A$25)","v":0},{"$f":"GETPIVOTDATA(\"Suma de bas165\",TD!$A$25)","v":0},{"$f":"GETPIVOTDATA(\"Suma de bas166\",TD!$A$25)","v":0},{"$f":"GETPIVOTDATA(\"Suma de bas167\",TD!$A$25)","v":0}]
[]
[null,null,null,null,null,null,null,"Inicial",null,"Primaria",null,"Secundaria",null,"Especial"]
[null,null,null,null,null,null,null,"Nº","Capacitados","Nº","Capacitados","Nº","Capacitados","Nº","Capacitados"]
[null,"0109",null,"Reunión de Sensibilización con los miembros de las APAFA",null,null,null,{"$f":"GETPIVOTDATA(\"Suma de bas168\",TD!$A$25)","v":0},{"$f":"GETPIVOTDATA(\"Suma de bas169\",TD!$A$25)","v":0},{"$f":"GETPIVOTDATA(\"Suma de bas170\",TD!$A$25)","v":0},{"$f":"GETPIVOTDATA(\"Suma de bas171\",TD!$A$25)","v":0},{"$f":"GETPIVOTDATA(\"Suma de bas172\",TD!$A$25)","v":0},{"$f":"GETPIVOTDATA(\"Suma de bas173\",TD!$A$25)","v":0},{"$f":"GETPIVOTDATA(\"Suma de bas174\",TD!$A$25)","v":0},{"$f":"GETPIVOTDATA(\"Suma de bas175\",TD!$A$25)","v":0}]
[]
[null,null,null,null,null,null,null,"Inicial",null,"Primaria",null,"Secundaria",null,"Especial"]
[null,null,null,null,null,null,null,"1º Visita","2º Visita","1º Visita","2º Visita","1º Visita","2º Visita","1º Visita","2º Visita"]
[null,"0110",null,"Visitas de Monitoreo de Implementación de los Acuerdos",null,null,null,{"$f":"GETPIVOTDATA(\"Suma de bas176\",TD!$A$25)","v":0},{"$f":"GETPIVOTDATA(\"Suma de bas177\",TD!$A$25)","v":0},{"$f":"GETPIVOTDATA(\"Suma de bas178\",TD!$A$25)","v":0},{"$f":"GETPIVOTDATA(\"Suma de bas179\",TD!$A$25)","v":0},{"$f":"GETPIVOTDATA(\"Suma de bas180\",TD!$A$25)","v":0},{"$f":"GETPIVOTDATA(\"Suma de bas181\",TD!$A$25)","v":0},{"$f":"GETPIVOTDATA(\"Suma de bas182\",TD!$A$25)","v":0},{"$f":"GETPIVOTDATA(\"Suma de bas183\",TD!$A$25)","v":0}]
[]
[null,null,null,null,null,null,null,null,null,null,null,"Inicial","Primaria","Secundaria","Especial"]
[null,"0111",null,"Visita Evaluación Conjunta de logros Alcanzados de Acuerdo al Plan Anual de Trabajo de las Instituciones Educativas",null,null,null,null,null,null,null,{"$f":"GETPIVOTDATA(\"Suma de bas184\",TD!$A$25)","v":0},{"$f":"GETPIVOTDATA(\"Suma de bas185\",TD!$A$25)","v":0},{"$f":"GETPIVOTDATA(\"Suma de bas186\",TD!$A$25)","v":0},{"$f":"GETPIVOTDATA(\"Suma de bas187\",TD!$A$25)","v":0}]
[]
[]
["OTRAS ACTIVIDADES"]
[null,"1.","Taller de Capacitación al personal de salud en Programas Presupuestales"]
[]
[null,null,null,"TOTAL TALLERES",null,"Articulado Nutricional",null,"Materno Neonatal",null,"Salud Mental",null,"Trasmisibles",null,"No Trasmisibles"]
[null,null,null,"Nº","Participantes","Nº","Participantes","Nº","Participantes","Nº","Participantes","Nº","Participantes","Nº","Participantes"]
[null,"0112",null,{"$f":"F73+H73+J73+L73+N73","v":0},{"$f":"G73+I73+K73+M73+O73","v":0},{"$f":"GETPIVOTDATA(\"Suma de bas188\",TD!$A$25)","v":0},{"$f":"GETPIVOTDATA(\"Suma de bas189\",TD!$A$25)","v":0},{"$f":"GETPIVOTDATA(\"Suma de bas190\",TD!$A$25)","v":0},{"$f":"GETPIVOTDATA(\"Suma de bas191\",TD!$A$25)","v":0},{"$f":"GETPIVOTDATA(\"Suma de bas192\",TD!$A$25)","v":0},{"$f":"GETPIVOTDATA(\"Suma de bas193\",TD!$A$25)","v":0},{"$f":"GETPIVOTDATA(\"Suma de bas194\",TD!$A$25)","v":0},{"$f":"GETPIVOTDATA(\"Suma de bas195\",TD!$A$25)","v":0},{"$f":"GETPIVOTDATA(\"Suma de bas196\",TD!$A$25)","v":0},{"$f":"GETPIVOTDATA(\"Suma de bas197\",TD!$A$25)","v":0}]
[]
["Reporte HIS_2015 / OGEI"]